{"text_format":"1","workbook":"xlsx","n_sheets":6,"sheets":["Invoer","Algemene instructies","Veld instructies","Lijsten","ExportBezoek","ExportWaarneming"],"not_rendered":{"charts":0,"images":0,"macros":1,"external_links":0,"defined_names":10,"comments":0,"pivot_tables":0},"unopened":[],"bounds":{"document_bytes":16777216,"sheet_cells":100000,"rows_first":2000,"rows_last":500,"rows_between":2000,"halvings":0,"cell_chars":16384,"cell_head_chars":4096},"cells_cut":0,"cells_raw":0,"read":"whole","date_system":"1900"}

{"sheet":"Invoer","index":0,"n_rows":140,"n_cols":9,"rows_kept":140,"cut":false,"hidden":false,"merged":[[8,4,8,7],[9,4,9,7],[5,3,5,4],[6,3,6,4],[5,5,5,7],[6,5,6,7]]}
["Formulier wintertelling Vogelbeschermingswacht Zaanstreek"]
[]
["Gebied","Code waarnemer","Datum","Begintijd","Eindtijd","Windrichting","Windkracht","Temperatuur"]
[]
[]
["Neerslag","Zicht","Kijker","Methode",null,"Telobject"]
[]
[]
["Bewolking","Waterstand","Sneeuw","IJs","Notitie"]
[]
[]
["Code","Nummer","Nederlandse naam","Totaal","Man","Vrouw","Juveniel","Notitie"]
[{"$f":"IF(ISBLANK($C13),\"\",VLOOKUP($C13,Lijsten!$A$1:$C$343,2,FALSE))","v":"GEEN"},{"$f":"IF(ISBLANK($C13),\"\",VLOOKUP($C13,Lijsten!$A$1:$C$343,3,FALSE))","v":"00000"},"geen",null,null,null,null,null,{"$f":"IF(AND(OR(D13=\"\",ISNUMBER(D13)),OR(E13=\"\",ISNUMBER(E13)),OR(F13=\"\",ISNUMBER(F13)),OR(G13=\"\",ISNUMBER(G13)),NOT((E13+F13+G13)>D13)),\"\",\"FOUT\")","v":""}]
[{"$f":"IF(ISBLANK($C14),\"\",VLOOKUP($C14,Lijsten!$A$1:$C$343,2,FALSE))","v":"DODA"},{"$f":"IF(ISBLANK($C14),\"\",VLOOKUP($C14,Lijsten!$A$1:$C$343,3,FALSE))","v":"00070"},"dodaars",null,null,null,null,null,{"$f":"IF(AND(OR(D14=\"\",ISNUMBER(D14)),OR(E14=\"\",ISNUMBER(E14)),OR(F14=\"\",ISNUMBER(F14)),OR(G14=\"\",ISNUMBER(G14)),NOT((E14+F14+G14)>D14)),\"\",\"FOUT\")","v":""}]
[{"$f":"IF(ISBLANK($C15),\"\",VLOOKUP($C15,Lijsten!$A$1:$C$343,2,FALSE))","v":"FUUT"},{"$f":"IF(ISBLANK($C15),\"\",VLOOKUP($C15,Lijsten!$A$1:$C$343,3,FALSE))","v":"00090"},"fuut",null,null,null,null,null,""]
[{"$f":"IF(ISBLANK($C16),\"\",VLOOKUP($C16,Lijsten!$A$1:$C$343,2,FALSE))","v":"AAL"},{"$f":"IF(ISBLANK($C16),\"\",VLOOKUP($C16,Lijsten!$A$1:$C$343,3,FALSE))","v":"00720"},"aalscholver",null,null,null,null,null,""]
[{"$f":"IF(ISBLANK($C17),\"\",VLOOKUP($C17,Lijsten!$A$1:$C$343,2,FALSE))","v":"ROER"},{"$f":"IF(ISBLANK($C17),\"\",VLOOKUP($C17,Lijsten!$A$1:$C$343,3,FALSE))","v":"00950"},"roerdomp",null,null,null,null,null,""]
[{"$f":"IF(ISBLANK($C18),\"\",VLOOKUP($C18,Lijsten!$A$1:$C$343,2,FALSE))","v":"GRZR"},{"$f":"IF(ISBLANK($C18),\"\",VLOOKUP($C18,Lijsten!$A$1:$C$343,3,FALSE))","v":"01210"},"grote zilverreiger",null,null,null,null,null,""]
[{"$f":"IF(ISBLANK($C19),\"\",VLOOKUP($C19,Lijsten!$A$1:$C$343,2,FALSE))","v":"BLAR"},{"$f":"IF(ISBLANK($C19),\"\",VLOOKUP($C19,Lijsten!$A$1:$C$343,3,FALSE))","v":"01220"},"blauwe reiger",null,null,null,null,null,""]
[{"$f":"IF(ISBLANK($C20),\"\",VLOOKUP($C20,Lijsten!$A$1:$C$343,2,FALSE))","v":"LEPE"},{"$f":"IF(ISBLANK($C20),\"\",VLOOKUP($C20,Lijsten!$A$1:$C$343,3,FALSE))","v":"01440"},"lepelaar",null,null,null,null,null,""]
{"$rows_left_out":121}
{"sheet":"Algemene instructies","index":1,"n_rows":25,"n_cols":1,"rows_kept":25,"cut":false,"hidden":false,"merged":[]}
["Algemeen"]
["Dit formulier kunt u gebruiken voor het electronisch doorgeven van de telgegevens aan de Vogelwacht. Bij de Vogelwacht wordt het formulier automatisch geimporteerd in een database. Om dit importeren goed te laten verlpen, is het van belang om niets aan het formulier te veranderen (zie ook kopje Beveiliging).\nVoor een beschrijving van de in te vullen velden kunt u het tabblad \"Veld instructies\" lezen. Hier wordt per veld beschreven wat er ingevoerd dient te worden.\nDe volgorde waarop u de vogels invoert bij gebruik van een leeg sjabloon (zie kopje \"Versies\") is niet van invloed op het importeren. Hier bent u dus vrij in."]
[]
["Inzending"]
["U kunt het ingevulde formulier opslaan en per e-mail opsturen naar de coördinator via het e-mail adres wintertelling@vogelwachtzaanstreek.nl. Om de verwerking eenvoudiger te maken wordt u verzocht de gebiedscode en datum van de telling op te nemen in de bestandsnaam. (bijv. 20060915 KWN.xls)"]
[]
["Beveiliging"]
["Om het importeren van de gegevens goed te kunnen laten verlopen, is het van groot belang dat er niets veranderd wordt aan het formulier. Om veranderingen te voorkomen is een groot deel van het formulier dan ook beveiligd. Wanneer u hier iets probeert in te voeren of te verwijderen, zult u een melding krijgen dat dit onmogelijk is. Sommige operaties (bijv. rij invoegen) zijn echter ondanks de beveiliging nog wel mogelijk. U wordt dringend verzocht deze NIET uit te voeren. Mocht u per ongeluk een rij verkeerd invoeren (bijv. een verkeerde vogel selecteren), voer de juiste gegevens dan gewoon over de foutieve waarden in."]
[]
["Verplichte velden en macro waarschuwing"]
["Een aantal velden op het telformulier zijn verplicht in te voeren. Deze zijn voorzien van een rood kader in de koptitel (bijv. Gebied). Deze velden maken een telformulier uniek binnen de database waarin ze geimporteerd worden. Wanneer u een formulier wilt opslaan met een van de verplichte velden nog niet ingevoerd. Dan zult u een melding krijgen dat dit niet mogelijk is !!\nHet afdwingen van de verplichte velden wordt uitgevoerd met behulp van een stukje macro-code. Daarom zult u bij het openen van het formulier een waarschuwing van Excel krijgen dat het bestand macro's bevat (exacte melding afhankelijk van de door u gebruikte versie). Hier heeft u de keuze om de macro's uit dan wel in te schakelen. Kies hier voor het INSCHAKELEN van macro's."]
[]
["Versienummer"]
["2.2.8"]
[]
["Versies"]
["Er zijn drie versies van dit telformulier beschikbaar."]
["1. Standaard formulier - Het telformulier waarbij de vogelsoorten die in de Zaanstreek het meest waargenomen worden, reeds zijn ingevoerd. Eventuele soorten die niet op het formulier staan, kunnen zelf toegevoegd worden."]
["2. Uitgebreid formulier - Een telformulier met een uitgebreidere lijst van te voren ingevoerd vogels. Met name geschikt voor gebieden waar veel soorten voorkomen."]
["3. Leeg sjabloon - Alleen het kale formulier, de lijst met vogels is niet van te voren ingevoerd. Dit sjabloon is met name geschikt voor het zelf maken van een eigen standaard formulier. "]
{"$rows_left_out":6}
{"sheet":"Veld instructies","index":2,"n_rows":30,"n_cols":2,"rows_kept":30,"cut":false,"hidden":false,"merged":[]}
[]
["Gebied","Voer hier de gebiedscode in die u van de Vogelwacht heeft ontvangen"]
["Code waarnemer","Voor hier uw waarnemerscode in die u van de Vogelwacht heeft ontvangen. Mocht u met meerdere personen tellen, voer dan slechts één code in !! De andere tellers kunt u opnemen bij het veld notitie."]
["Datum","Voer de datum van de telling in. Gebruik hierbij het formaat dag - maand - jaar (dd-mm-jj)"]
["Begintijd","Voer de starttijd van de telling in. Gebruik hierbij het formaat uur : minuut (uu:mm)"]
["Eindtijd","Voer de eindtijd van de telling in. Gebruik hierbij het formaat uur : minuut (uu:mm)"]
["Windrichting","Voer hier de letter(combinatie) in van de windrichting (dus O, N, NO, etc.)"]
["Windkracht","Voer hier de windkracht in op de schaal van beaufort (1 , 2 , etc.)"]
["Temperatuur","Voer hier de temperatuur in graden Celcius in, noteer alleen het getal. Dus 15 en niet 15C."]
["Neerslag","Voer hier de hoeveelheid neerslag in. Maak eventueel gebruik van termen als bui, veel, etc."]
["Zicht","Kies een waarde uit de lijst."]
["Kijker","Voor hier de sterkte van uw kijker in (bijv. 8 x 40)"]
["Methode","Kies een waarde uit de lijst."]
["Telobject","Kies een waarde uit de lijst."]
["Bewolking","Kies een waarde uit de lijst. De bewolking wordt uitgedrukt in 8e delen (0/8 is onbewolkt, 8/8 geheel bewolkt)"]
["Waterstand","Voer hier de waterstand in. Wanneer de stand nergens afgelezen kan worden, maak dan gebruik van termen als (laag, normaal, hoog, etc.)"]
["Sneeuw","Geef aan of en eventueel hoeveel sneeuw er is."]
["IJs","Geef hier de eventuele ijsdekking aan, in percentages van bevroren oppervlakte, of met een andere duidelijke beschrijving"]
["Notitie","Voer hier eventueele opmerkingen in. Hier kunt u ook extra tellers opvoeren wanneer u met meerdere personen telt."]
[]
{"$rows_left_out":11}
{"sheet":"Lijsten","index":3,"n_rows":343,"n_cols":7,"rows_kept":343,"cut":false,"hidden":true,"merged":[]}
["Aalscholver","AAL","00720",null,null,"Alle soorten",1]
["Alk","ALK","06360",null,null,"Water/Roofvogels",2]
["Alpengierzwaluw","ALPG","07980",null,null,"Water/Stelt/Roofvogels",3]
["Alpenheggemus","ALPH","10940",null,null,"Water/Stelt/Roofvogels/Meeuwen",4]
["Amerikaanse Kuifeend","AMKU","02000"]
["Amerikaanse Smient","AMSM","01800"]
["Appelvink","APVI","17170"]
["Arendbuizerd","AREB","02880",null,null,"Gebied doorkruist",1]
["Baardmannetje","BAAR","13640",null,null,"Randtelling",2]
["Barmsijs","BARM","16630"]
["Bastaardarend","BASA","02930"]
["Beflijster","BEFL","11860"]
["Bergeend","BERG","01730"]
["Bijeneter","BIJE","08400"]
["Bladkoninkje","BLAD","13000"]
["Blauwborst","BLBO",11060]
["Blauwe Kiekendief","BLKI","02610"]
["Blauwe Reiger","BLAR","01220"]
["Blauwvleugeltaling","BLAT","01920"]
["Boerenzwaluw","BOZW","09920"]
{"$rows_left_out":324}
{"sheet":"ExportBezoek","index":4,"n_rows":2,"n_cols":19,"rows_kept":2,"cut":false,"hidden":true,"merged":[]}
["code","gebied","waarnemer","datum","begintijd","eindtijd","windrichting","windkracht","temperatuur","neerslag","zicht","kijker","methode","objecten","bewolking","waterstand","sneeuw","ijs","notitie"]
[{"$f":"Invoer!A$4&Invoer!B$4&TEXT(Invoer!C$4,\"dd-mm-jjjj\")&TEXT(Invoer!D$4,\"uu:mm\")","v":"00-01-190000:00"},{"$f":"Invoer!A4","v":0},{"$f":"Invoer!B4","v":0},{"$f":"Invoer!C4","v":"00:00:00"},{"$f":"IF(ISBLANK(Invoer!D4),,Invoer!D4)","v":"00:00:00"},{"$f":"IF(ISBLANK(Invoer!E4),,Invoer!E4)","v":"00:00:00"},{"$f":"IF(ISBLANK(Invoer!F4),\"-\",Invoer!F4)","v":"-"},{"$f":"IF(ISBLANK(Invoer!G4),\"-\",Invoer!G4)","v":"-"},{"$f":"IF(ISBLANK(Invoer!H4),\"-\",Invoer!H4)","v":"-"},{"$f":"IF(ISBLANK(Invoer!A7),\"-\",Invoer!A7)","v":"-"},{"$f":"IF(ISBLANK(Invoer!B7),\"-\",Invoer!B7)","v":"-"},{"$f":"IF(ISBLANK(Invoer!C7),\"-\",Invoer!C7)","v":"-"},{"$f":"IF(ISBLANK(Invoer!D7),\"0\",VLOOKUP(Invoer!D7,Lijsten!F8:G9,2,FALSE))","v":"0"},{"$f":"IF(ISBLANK(Invoer!F7),\"0\",VLOOKUP(Invoer!F7,Lijsten!F1:G4,2,FALSE))","v":"0"},{"$f":"IF(ISBLANK(Invoer!A10),\"-\",Invoer!A10)","v":"-"},{"$f":"IF(ISBLANK(Invoer!B10),\"-\",Invoer!B10)","v":"-"},{"$f":"IF(ISBLANK(Invoer!C10),\"-\",Invoer!C10)","v":"-"},{"$f":"IF(ISBLANK(Invoer!D10),\"-\",Invoer!D10)","v":"-"},{"$f":"IF(ISBLANK(Invoer!E10),\"-\",Invoer!E10)","v":"-"}]

{"sheet":"ExportWaarneming","index":5,"n_rows":135,"n_cols":7,"rows_kept":135,"cut":false,"hidden":true,"merged":[]}
["Code","soort","totaal","man","vrouw","onvolwassen","notitie"]
[{"$f":"Invoer!A$4&Invoer!B$4&TEXT(Invoer!C$4,\"dd-mm-jjjj\")&TEXT(Invoer!D$4,\"uu:mm\")","v":"00-01-190000:00"},{"$f":"IF(NOT(Invoer!B13=\"\"),Invoer!B13)","v":"00000"},{"$f":"IF(NOT(Invoer!D13=\"\"),Invoer!D13,)","v":0},{"$f":"IF(NOT(Invoer!E13=\"\"),Invoer!E13,)","v":0},{"$f":"IF(NOT(Invoer!F13=\"\"),Invoer!F13,)","v":0},{"$f":"IF(NOT(Invoer!G13=\"\"),Invoer!G13,)","v":0},{"$f":"IF(Invoer!H13=\"\",\"-\",Invoer!H13)","v":"-"}]
[{"$f":"Invoer!A$4&Invoer!B$4&TEXT(Invoer!C$4,\"dd-mm-jjjj\")&TEXT(Invoer!D$4,\"uu:mm\")","v":"00-01-190000:00"},{"$f":"IF(NOT(Invoer!B14=\"\"),Invoer!B14)","v":"00070"},{"$f":"IF(NOT(Invoer!D14=\"\"),Invoer!D14,)","v":0},{"$f":"IF(NOT(Invoer!E14=\"\"),Invoer!E14,)","v":0},{"$f":"IF(NOT(Invoer!F14=\"\"),Invoer!F14,)","v":0},{"$f":"IF(NOT(Invoer!G14=\"\"),Invoer!G14,)","v":0},{"$f":"IF(Invoer!H14=\"\",\"-\",Invoer!H14)","v":"-"}]
[{"$f":"Invoer!A$4&Invoer!B$4&TEXT(Invoer!C$4,\"dd-mm-jjjj\")&TEXT(Invoer!D$4,\"uu:mm\")","v":"00-01-190000:00"},{"$f":"IF(NOT(Invoer!B15=\"\"),Invoer!B15)","v":"00090"},{"$f":"IF(NOT(Invoer!D15=\"\"),Invoer!D15,)","v":0},{"$f":"IF(NOT(Invoer!E15=\"\"),Invoer!E15,)","v":0},{"$f":"IF(NOT(Invoer!F15=\"\"),Invoer!F15,)","v":0},{"$f":"IF(NOT(Invoer!G15=\"\"),Invoer!G15,)","v":0},{"$f":"IF(Invoer!H15=\"\",\"-\",Invoer!H15)","v":"-"}]
[{"$f":"Invoer!A$4&Invoer!B$4&TEXT(Invoer!C$4,\"dd-mm-jjjj\")&TEXT(Invoer!D$4,\"uu:mm\")","v":"00-01-190000:00"},{"$f":"IF(NOT(Invoer!B16=\"\"),Invoer!B16)","v":"00720"},{"$f":"IF(NOT(Invoer!D16=\"\"),Invoer!D16,)","v":0},{"$f":"IF(NOT(Invoer!E16=\"\"),Invoer!E16,)","v":0},{"$f":"IF(NOT(Invoer!F16=\"\"),Invoer!F16,)","v":0},{"$f":"IF(NOT(Invoer!G16=\"\"),Invoer!G16,)","v":0},{"$f":"IF(Invoer!H16=\"\",\"-\",Invoer!H16)","v":"-"}]
[{"$f":"Invoer!A$4&Invoer!B$4&TEXT(Invoer!C$4,\"dd-mm-jjjj\")&TEXT(Invoer!D$4,\"uu:mm\")","v":"00-01-190000:00"},{"$f":"IF(NOT(Invoer!B17=\"\"),Invoer!B17)","v":"00950"},{"$f":"IF(NOT(Invoer!D17=\"\"),Invoer!D17,)","v":0},{"$f":"IF(NOT(Invoer!E17=\"\"),Invoer!E17,)","v":0},{"$f":"IF(NOT(Invoer!F17=\"\"),Invoer!F17,)","v":0},{"$f":"IF(NOT(Invoer!G17=\"\"),Invoer!G17,)","v":0},{"$f":"IF(Invoer!H17=\"\",\"-\",Invoer!H17)","v":"-"}]
[{"$f":"Invoer!A$4&Invoer!B$4&TEXT(Invoer!C$4,\"dd-mm-jjjj\")&TEXT(Invoer!D$4,\"uu:mm\")","v":"00-01-190000:00"},{"$f":"IF(NOT(Invoer!B18=\"\"),Invoer!B18)","v":"01210"},{"$f":"IF(NOT(Invoer!D18=\"\"),Invoer!D18,)","v":0},{"$f":"IF(NOT(Invoer!E18=\"\"),Invoer!E18,)","v":0},{"$f":"IF(NOT(Invoer!F18=\"\"),Invoer!F18,)","v":0},{"$f":"IF(NOT(Invoer!G18=\"\"),Invoer!G18,)","v":0},{"$f":"IF(Invoer!H18=\"\",\"-\",Invoer!H18)","v":"-"}]
[{"$f":"Invoer!A$4&Invoer!B$4&TEXT(Invoer!C$4,\"dd-mm-jjjj\")&TEXT(Invoer!D$4,\"uu:mm\")","v":"00-01-190000:00"},{"$f":"IF(NOT(Invoer!B19=\"\"),Invoer!B19)","v":"01220"},{"$f":"IF(NOT(Invoer!D19=\"\"),Invoer!D19,)","v":0},{"$f":"IF(NOT(Invoer!E19=\"\"),Invoer!E19,)","v":0},{"$f":"IF(NOT(Invoer!F19=\"\"),Invoer!F19,)","v":0},{"$f":"IF(NOT(Invoer!G19=\"\"),Invoer!G19,)","v":0},{"$f":"IF(Invoer!H19=\"\",\"-\",Invoer!H19)","v":"-"}]
[{"$f":"Invoer!A$4&Invoer!B$4&TEXT(Invoer!C$4,\"dd-mm-jjjj\")&TEXT(Invoer!D$4,\"uu:mm\")","v":"00-01-190000:00"},{"$f":"IF(NOT(Invoer!B20=\"\"),Invoer!B20)","v":"01440"},{"$f":"IF(NOT(Invoer!D20=\"\"),Invoer!D20,)","v":0},{"$f":"IF(NOT(Invoer!E20=\"\"),Invoer!E20,)","v":0},{"$f":"IF(NOT(Invoer!F20=\"\"),Invoer!F20,)","v":0},{"$f":"IF(NOT(Invoer!G20=\"\"),Invoer!G20,)","v":0},{"$f":"IF(Invoer!H20=\"\",\"-\",Invoer!H20)","v":"-"}]
[{"$f":"Invoer!A$4&Invoer!B$4&TEXT(Invoer!C$4,\"dd-mm-jjjj\")&TEXT(Invoer!D$4,\"uu:mm\")","v":"00-01-190000:00"},{"$f":"IF(NOT(Invoer!B21=\"\"),Invoer!B21)","v":"01520"},{"$f":"IF(NOT(Invoer!D21=\"\"),Invoer!D21,)","v":0},{"$f":"IF(NOT(Invoer!E21=\"\"),Invoer!E21,)","v":0},{"$f":"IF(NOT(Invoer!F21=\"\"),Invoer!F21,)","v":0},{"$f":"IF(NOT(Invoer!G21=\"\"),Invoer!G21,)","v":0},{"$f":"IF(Invoer!H21=\"\",\"-\",Invoer!H21)","v":"-"}]
[{"$f":"Invoer!A$4&Invoer!B$4&TEXT(Invoer!C$4,\"dd-mm-jjjj\")&TEXT(Invoer!D$4,\"uu:mm\")","v":"00-01-190000:00"},{"$f":"IF(NOT(Invoer!B22=\"\"),Invoer!B22)","v":"01590"},{"$f":"IF(NOT(Invoer!D22=\"\"),Invoer!D22,)","v":0},{"$f":"IF(NOT(Invoer!E22=\"\"),Invoer!E22,)","v":0},{"$f":"IF(NOT(Invoer!F22=\"\"),Invoer!F22,)","v":0},{"$f":"IF(NOT(Invoer!G22=\"\"),Invoer!G22,)","v":0},{"$f":"IF(Invoer!H22=\"\",\"-\",Invoer!H22)","v":"-"}]
[{"$f":"Invoer!A$4&Invoer!B$4&TEXT(Invoer!C$4,\"dd-mm-jjjj\")&TEXT(Invoer!D$4,\"uu:mm\")","v":"00-01-190000:00"},{"$f":"IF(NOT(Invoer!B23=\"\"),Invoer!B23)","v":"01610"},{"$f":"IF(NOT(Invoer!D23=\"\"),Invoer!D23,)","v":0},{"$f":"IF(NOT(Invoer!E23=\"\"),Invoer!E23,)","v":0},{"$f":"IF(NOT(Invoer!F23=\"\"),Invoer!F23,)","v":0},{"$f":"IF(NOT(Invoer!G23=\"\"),Invoer!G23,)","v":0},{"$f":"IF(Invoer!H23=\"\",\"-\",Invoer!H23)","v":"-"}]
[{"$f":"Invoer!A$4&Invoer!B$4&TEXT(Invoer!C$4,\"dd-mm-jjjj\")&TEXT(Invoer!D$4,\"uu:mm\")","v":"00-01-190000:00"},{"$f":"IF(NOT(Invoer!B24=\"\"),Invoer!B24)","v":"01668"},{"$f":"IF(NOT(Invoer!D24=\"\"),Invoer!D24,)","v":0},{"$f":"IF(NOT(Invoer!E24=\"\"),Invoer!E24,)","v":0},{"$f":"IF(NOT(Invoer!F24=\"\"),Invoer!F24,)","v":0},{"$f":"IF(NOT(Invoer!G24=\"\"),Invoer!G24,)","v":0},{"$f":"IF(Invoer!H24=\"\",\"-\",Invoer!H24)","v":"-"}]
[{"$f":"Invoer!A$4&Invoer!B$4&TEXT(Invoer!C$4,\"dd-mm-jjjj\")&TEXT(Invoer!D$4,\"uu:mm\")","v":"00-01-190000:00"},{"$f":"IF(NOT(Invoer!B25=\"\"),Invoer!B25)","v":"01670"},{"$f":"IF(NOT(Invoer!D25=\"\"),Invoer!D25,)","v":0},{"$f":"IF(NOT(Invoer!E25=\"\"),Invoer!E25,)","v":0},{"$f":"IF(NOT(Invoer!F25=\"\"),Invoer!F25,)","v":0},{"$f":"IF(NOT(Invoer!G25=\"\"),Invoer!G25,)","v":0},{"$f":"IF(Invoer!H25=\"\",\"-\",Invoer!H25)","v":"-"}]
[{"$f":"Invoer!A$4&Invoer!B$4&TEXT(Invoer!C$4,\"dd-mm-jjjj\")&TEXT(Invoer!D$4,\"uu:mm\")","v":"00-01-190000:00"},{"$f":"IF(NOT(Invoer!B26=\"\"),Invoer!B26)","v":"01700"},{"$f":"IF(NOT(Invoer!D26=\"\"),Invoer!D26,)","v":0},{"$f":"IF(NOT(Invoer!E26=\"\"),Invoer!E26,)","v":0},{"$f":"IF(NOT(Invoer!F26=\"\"),Invoer!F26,)","v":0},{"$f":"IF(NOT(Invoer!G26=\"\"),Invoer!G26,)","v":0},{"$f":"IF(Invoer!H26=\"\",\"-\",Invoer!H26)","v":"-"}]
[{"$f":"Invoer!A$4&Invoer!B$4&TEXT(Invoer!C$4,\"dd-mm-jjjj\")&TEXT(Invoer!D$4,\"uu:mm\")","v":"00-01-190000:00"},{"$f":"IF(NOT(Invoer!B27=\"\"),Invoer!B27)","v":"01721"},{"$f":"IF(NOT(Invoer!D27=\"\"),Invoer!D27,)","v":0},{"$f":"IF(NOT(Invoer!E27=\"\"),Invoer!E27,)","v":0},{"$f":"IF(NOT(Invoer!F27=\"\"),Invoer!F27,)","v":0},{"$f":"IF(NOT(Invoer!G27=\"\"),Invoer!G27,)","v":0},{"$f":"IF(Invoer!H27=\"\",\"-\",Invoer!H27)","v":"-"}]
[{"$f":"Invoer!A$4&Invoer!B$4&TEXT(Invoer!C$4,\"dd-mm-jjjj\")&TEXT(Invoer!D$4,\"uu:mm\")","v":"00-01-190000:00"},{"$f":"IF(NOT(Invoer!B28=\"\"),Invoer!B28)","v":"01730"},{"$f":"IF(NOT(Invoer!D28=\"\"),Invoer!D28,)","v":0},{"$f":"IF(NOT(Invoer!E28=\"\"),Invoer!E28,)","v":0},{"$f":"IF(NOT(Invoer!F28=\"\"),Invoer!F28,)","v":0},{"$f":"IF(NOT(Invoer!G28=\"\"),Invoer!G28,)","v":0},{"$f":"IF(Invoer!H28=\"\",\"-\",Invoer!H28)","v":"-"}]
[{"$f":"Invoer!A$4&Invoer!B$4&TEXT(Invoer!C$4,\"dd-mm-jjjj\")&TEXT(Invoer!D$4,\"uu:mm\")","v":"00-01-190000:00"},{"$f":"IF(NOT(Invoer!B29=\"\"),Invoer!B29)","v":"01790"},{"$f":"IF(NOT(Invoer!D29=\"\"),Invoer!D29,)","v":0},{"$f":"IF(NOT(Invoer!E29=\"\"),Invoer!E29,)","v":0},{"$f":"IF(NOT(Invoer!F29=\"\"),Invoer!F29,)","v":0},{"$f":"IF(NOT(Invoer!G29=\"\"),Invoer!G29,)","v":0},{"$f":"IF(Invoer!H29=\"\",\"-\",Invoer!H29)","v":"-"}]
[{"$f":"Invoer!A$4&Invoer!B$4&TEXT(Invoer!C$4,\"dd-mm-jjjj\")&TEXT(Invoer!D$4,\"uu:mm\")","v":"00-01-190000:00"},{"$f":"IF(NOT(Invoer!B30=\"\"),Invoer!B30)","v":"01820"},{"$f":"IF(NOT(Invoer!D30=\"\"),Invoer!D30,)","v":0},{"$f":"IF(NOT(Invoer!E30=\"\"),Invoer!E30,)","v":0},{"$f":"IF(NOT(Invoer!F30=\"\"),Invoer!F30,)","v":0},{"$f":"IF(NOT(Invoer!G30=\"\"),Invoer!G30,)","v":0},{"$f":"IF(Invoer!H30=\"\",\"-\",Invoer!H30)","v":"-"}]
[{"$f":"Invoer!A$4&Invoer!B$4&TEXT(Invoer!C$4,\"dd-mm-jjjj\")&TEXT(Invoer!D$4,\"uu:mm\")","v":"00-01-190000:00"},{"$f":"IF(NOT(Invoer!B31=\"\"),Invoer!B31)","v":"01840"},{"$f":"IF(NOT(Invoer!D31=\"\"),Invoer!D31,)","v":0},{"$f":"IF(NOT(Invoer!E31=\"\"),Invoer!E31,)","v":0},{"$f":"IF(NOT(Invoer!F31=\"\"),Invoer!F31,)","v":0},{"$f":"IF(NOT(Invoer!G31=\"\"),Invoer!G31,)","v":0},{"$f":"IF(Invoer!H31=\"\",\"-\",Invoer!H31)","v":"-"}]
{"$rows_left_out":115}