{"text_format":"1","workbook":"xlsx","n_sheets":6,"sheets":["Invoer","Algemene instructies","Veld instructies","Lijsten","ExportBezoek","ExportWaarneming"],"not_rendered":{"charts":0,"images":0,"macros":1,"external_links":0,"defined_names":10,"comments":0,"pivot_tables":0},"unopened":[],"bounds":{"document_bytes":16777216,"sheet_cells":100000,"rows_first":2000,"rows_last":500,"rows_between":2000,"halvings":0,"cell_chars":16384,"cell_head_chars":4096},"cells_cut":0,"cells_raw":0,"read":"whole","date_system":"1900"}

{"sheet":"Invoer","index":0,"n_rows":140,"n_cols":9,"rows_kept":140,"cut":false,"hidden":false,"merged":[[8,4,8,7],[9,4,9,7],[5,3,5,4],[6,3,6,4],[5,5,5,7],[6,5,6,7]]}
["Formulier wintertelling Vogelbeschermingswacht Zaanstreek"]
[]
["Gebied","Code waarnemer","Datum","Begintijd","Eindtijd","Windrichting","Windkracht","Temperatuur"]
[]
[]
["Neerslag","Zicht","Kijker","Methode",null,"Telobject"]
[]
[]
["Bewolking","Waterstand","Sneeuw","IJs","Notitie"]
[]
[]
["Code","Nummer","Nederlandse naam","Totaal","Man","Vrouw","Juveniel","Notitie"]
[{"$f":"IF(ISBLANK($C13),\"\",VLOOKUP($C13,Lijsten!$A$1:$C$343,2,FALSE))","v":"GEEN"},{"$f":"IF(ISBLANK($C13),\"\",VLOOKUP($C13,Lijsten!$A$1:$C$343,3,FALSE))","v":"00000"},"geen",null,null,null,null,null,{"$f":"IF(AND(OR(D13=\"\",ISNUMBER(D13)),OR(E13=\"\",ISNUMBER(E13)),OR(F13=\"\",ISNUMBER(F13)),OR(G13=\"\",ISNUMBER(G13)),NOT((E13+F13+G13)>D13)),\"\",\"FOUT\")","v":""}]
[{"$f":"IF(ISBLANK($C14),\"\",VLOOKUP($C14,Lijsten!$A$1:$C$343,2,FALSE))","v":"DODA"},{"$f":"IF(ISBLANK($C14),\"\",VLOOKUP($C14,Lijsten!$A$1:$C$343,3,FALSE))","v":"00070"},"dodaars",null,null,null,null,null,{"$f":"IF(AND(OR(D14=\"\",ISNUMBER(D14)),OR(E14=\"\",ISNUMBER(E14)),OR(F14=\"\",ISNUMBER(F14)),OR(G14=\"\",ISNUMBER(G14)),NOT((E14+F14+G14)>D14)),\"\",\"FOUT\")","v":""}]
[{"$f":"IF(ISBLANK($C15),\"\",VLOOKUP($C15,Lijsten!$A$1:$C$343,2,FALSE))","v":"FUUT"},{"$f":"IF(ISBLANK($C15),\"\",VLOOKUP($C15,Lijsten!$A$1:$C$343,3,FALSE))","v":"00090"},"fuut",null,null,null,null,null,""]
[{"$f":"IF(ISBLANK($C16),\"\",VLOOKUP($C16,Lijsten!$A$1:$C$343,2,FALSE))","v":"AAL"},{"$f":"IF(ISBLANK($C16),\"\",VLOOKUP($C16,Lijsten!$A$1:$C$343,3,FALSE))","v":"00720"},"aalscholver",null,null,null,null,null,""]
[{"$f":"IF(ISBLANK($C17),\"\",VLOOKUP($C17,Lijsten!$A$1:$C$343,2,FALSE))","v":"ROER"},{"$f":"IF(ISBLANK($C17),\"\",VLOOKUP($C17,Lijsten!$A$1:$C$343,3,FALSE))","v":"00950"},"roerdomp",null,null,null,null,null,""]
[{"$f":"IF(ISBLANK($C18),\"\",VLOOKUP($C18,Lijsten!$A$1:$C$343,2,FALSE))","v":"GRZR"},{"$f":"IF(ISBLANK($C18),\"\",VLOOKUP($C18,Lijsten!$A$1:$C$343,3,FALSE))","v":"01210"},"grote zilverreiger",null,null,null,null,null,""]
[{"$f":"IF(ISBLANK($C19),\"\",VLOOKUP($C19,Lijsten!$A$1:$C$343,2,FALSE))","v":"BLAR"},{"$f":"IF(ISBLANK($C19),\"\",VLOOKUP($C19,Lijsten!$A$1:$C$343,3,FALSE))","v":"01220"},"blauwe reiger",null,null,null,null,null,""]
[{"$f":"IF(ISBLANK($C20),\"\",VLOOKUP($C20,Lijsten!$A$1:$C$343,2,FALSE))","v":"LEPE"},{"$f":"IF(ISBLANK($C20),\"\",VLOOKUP($C20,Lijsten!$A$1:$C$343,3,FALSE))","v":"01440"},"lepelaar",null,null,null,null,null,""]
[{"$f":"IF(ISBLANK($C21),\"\",VLOOKUP($C21,Lijsten!$A$1:$C$343,2,FALSE))","v":"KNOB"},{"$f":"IF(ISBLANK($C21),\"\",VLOOKUP($C21,Lijsten!$A$1:$C$343,3,FALSE))","v":"01520"},"knobbelzwaan",null,null,null,null,null,""]
[{"$f":"IF(ISBLANK($C22),\"\",VLOOKUP($C22,Lijsten!$A$1:$C$343,2,FALSE))","v":"KOLG"},{"$f":"IF(ISBLANK($C22),\"\",VLOOKUP($C22,Lijsten!$A$1:$C$343,3,FALSE))","v":"01590"},"kolgans",null,null,null,null,null,""]
[{"$f":"IF(ISBLANK($C23),\"\",VLOOKUP($C23,Lijsten!$A$1:$C$343,2,FALSE))","v":"GRAG"},{"$f":"IF(ISBLANK($C23),\"\",VLOOKUP($C23,Lijsten!$A$1:$C$343,3,FALSE))","v":"01610"},"grauwe gans",null,null,null,null,null,""]
[{"$f":"IF(ISBLANK($C24),\"\",VLOOKUP($C24,Lijsten!$A$1:$C$343,2,FALSE))","v":"CANG"},{"$f":"IF(ISBLANK($C24),\"\",VLOOKUP($C24,Lijsten!$A$1:$C$343,3,FALSE))","v":"01668"},"canadese gans",null,null,null,null,null,""]
[{"$f":"IF(ISBLANK($C25),\"\",VLOOKUP($C25,Lijsten!$A$1:$C$343,2,FALSE))","v":"BRAG"},{"$f":"IF(ISBLANK($C25),\"\",VLOOKUP($C25,Lijsten!$A$1:$C$343,3,FALSE))","v":"01670"},"brandgans",null,null,null,null,null,""]
[{"$f":"IF(ISBLANK($C26),\"\",VLOOKUP($C26,Lijsten!$A$1:$C$343,2,FALSE))","v":"NIJG"},{"$f":"IF(ISBLANK($C26),\"\",VLOOKUP($C26,Lijsten!$A$1:$C$343,3,FALSE))","v":"01700"},"nijlgans",null,null,null,null,null,""]
[{"$f":"IF(ISBLANK($C27),\"\",VLOOKUP($C27,Lijsten!$A$1:$C$343,2,FALSE))","v":"SOGA"},{"$f":"IF(ISBLANK($C27),\"\",VLOOKUP($C27,Lijsten!$A$1:$C$343,3,FALSE))","v":"01721"},"soepgans",null,null,null,null,null,""]
[{"$f":"IF(ISBLANK($C28),\"\",VLOOKUP($C28,Lijsten!$A$1:$C$343,2,FALSE))","v":"BERG"},{"$f":"IF(ISBLANK($C28),\"\",VLOOKUP($C28,Lijsten!$A$1:$C$343,3,FALSE))","v":"01730"},"bergeend",null,null,null,null,null,""]
[{"$f":"IF(ISBLANK($C29),\"\",VLOOKUP($C29,Lijsten!$A$1:$C$343,2,FALSE))","v":"SMIE"},{"$f":"IF(ISBLANK($C29),\"\",VLOOKUP($C29,Lijsten!$A$1:$C$343,3,FALSE))","v":"01790"},"smient",null,null,null,null,null,""]
[{"$f":"IF(ISBLANK($C30),\"\",VLOOKUP($C30,Lijsten!$A$1:$C$343,2,FALSE))","v":"KRAK"},{"$f":"IF(ISBLANK($C30),\"\",VLOOKUP($C30,Lijsten!$A$1:$C$343,3,FALSE))","v":"01820"},"krakeend",null,null,null,null,null,""]
[{"$f":"IF(ISBLANK($C31),\"\",VLOOKUP($C31,Lijsten!$A$1:$C$343,2,FALSE))","v":"WINT"},{"$f":"IF(ISBLANK($C31),\"\",VLOOKUP($C31,Lijsten!$A$1:$C$343,3,FALSE))","v":"01840"},"wintertaling",null,null,null,null,null,""]
[{"$f":"IF(ISBLANK($C32),\"\",VLOOKUP($C32,Lijsten!$A$1:$C$343,2,FALSE))","v":"WILE"},{"$f":"IF(ISBLANK($C32),\"\",VLOOKUP($C32,Lijsten!$A$1:$C$343,3,FALSE))","v":"01860"},"wilde eend",null,null,null,null,null,""]
[{"$f":"IF(ISBLANK($C33),\"\",VLOOKUP($C33,Lijsten!$A$1:$C$343,2,FALSE))","v":"SOEP"},{"$f":"IF(ISBLANK($C33),\"\",VLOOKUP($C33,Lijsten!$A$1:$C$343,3,FALSE))","v":"01861"},"soepeend",null,null,null,null,null,""]
[{"$f":"IF(ISBLANK($C34),\"\",VLOOKUP($C34,Lijsten!$A$1:$C$343,2,FALSE))","v":"PIJL"},{"$f":"IF(ISBLANK($C34),\"\",VLOOKUP($C34,Lijsten!$A$1:$C$343,3,FALSE))","v":"01890"},"pijlstaart",null,null,null,null,null,""]
[{"$f":"IF(ISBLANK($C35),\"\",VLOOKUP($C35,Lijsten!$A$1:$C$343,2,FALSE))","v":"SLOB"},{"$f":"IF(ISBLANK($C35),\"\",VLOOKUP($C35,Lijsten!$A$1:$C$343,3,FALSE))","v":"01940"},"slobeend",null,null,null,null,null,""]
[{"$f":"IF(ISBLANK($C36),\"\",VLOOKUP($C36,Lijsten!$A$1:$C$343,2,FALSE))","v":"TAFE"},{"$f":"IF(ISBLANK($C36),\"\",VLOOKUP($C36,Lijsten!$A$1:$C$343,3,FALSE))","v":"01980"},"tafeleend",null,null,null,null,null,""]
[{"$f":"IF(ISBLANK($C37),\"\",VLOOKUP($C37,Lijsten!$A$1:$C$343,2,FALSE))","v":"KUFE"},{"$f":"IF(ISBLANK($C37),\"\",VLOOKUP($C37,Lijsten!$A$1:$C$343,3,FALSE))","v":"02030"},"kuifeend",null,null,null,null,null,""]
[{"$f":"IF(ISBLANK($C38),\"\",VLOOKUP($C38,Lijsten!$A$1:$C$343,2,FALSE))","v":"BRIL"},{"$f":"IF(ISBLANK($C38),\"\",VLOOKUP($C38,Lijsten!$A$1:$C$343,3,FALSE))","v":"02180"},"brilduiker",null,null,null,null,null,""]
[{"$f":"IF(ISBLANK($C39),\"\",VLOOKUP($C39,Lijsten!$A$1:$C$343,2,FALSE))","v":"NON"},{"$f":"IF(ISBLANK($C39),\"\",VLOOKUP($C39,Lijsten!$A$1:$C$343,3,FALSE))","v":"02200"},"nonnetje",null,null,null,null,null,""]
[{"$f":"IF(ISBLANK($C40),\"\",VLOOKUP($C40,Lijsten!$A$1:$C$343,2,FALSE))","v":"GRZA"},{"$f":"IF(ISBLANK($C40),\"\",VLOOKUP($C40,Lijsten!$A$1:$C$343,3,FALSE))","v":"02230"},"grote zaagbek",null,null,null,null,null,""]
[{"$f":"IF(ISBLANK($C41),\"\",VLOOKUP($C41,Lijsten!$A$1:$C$343,2,FALSE))","v":"BRKI"},{"$f":"IF(ISBLANK($C41),\"\",VLOOKUP($C41,Lijsten!$A$1:$C$343,3,FALSE))","v":"02600"},"bruine kiekendief",null,null,null,null,null,""]
[{"$f":"IF(ISBLANK($C42),\"\",VLOOKUP($C42,Lijsten!$A$1:$C$343,2,FALSE))","v":"BLKI"},{"$f":"IF(ISBLANK($C42),\"\",VLOOKUP($C42,Lijsten!$A$1:$C$343,3,FALSE))","v":"02610"},"blauwe kiekendief",null,null,null,null,null,""]
[{"$f":"IF(ISBLANK($C43),\"\",VLOOKUP($C43,Lijsten!$A$1:$C$343,2,FALSE))","v":"HAVI"},{"$f":"IF(ISBLANK($C43),\"\",VLOOKUP($C43,Lijsten!$A$1:$C$343,3,FALSE))","v":"02670"},"havik",null,null,null,null,null,""]
[{"$f":"IF(ISBLANK($C44),\"\",VLOOKUP($C44,Lijsten!$A$1:$C$343,2,FALSE))","v":"SPER"},{"$f":"IF(ISBLANK($C44),\"\",VLOOKUP($C44,Lijsten!$A$1:$C$343,3,FALSE))","v":"02690"},"sperwer",null,null,null,null,null,""]
[{"$f":"IF(ISBLANK($C45),\"\",VLOOKUP($C45,Lijsten!$A$1:$C$343,2,FALSE))","v":"BUIZ"},{"$f":"IF(ISBLANK($C45),\"\",VLOOKUP($C45,Lijsten!$A$1:$C$343,3,FALSE))","v":"02870"},"buizerd",null,null,null,null,null,""]
[{"$f":"IF(ISBLANK($C46),\"\",VLOOKUP($C46,Lijsten!$A$1:$C$343,2,FALSE))","v":"TOVA"},{"$f":"IF(ISBLANK($C46),\"\",VLOOKUP($C46,Lijsten!$A$1:$C$343,3,FALSE))","v":"03040"},"torenvalk",null,null,null,null,null,""]
[{"$f":"IF(ISBLANK($C47),\"\",VLOOKUP($C47,Lijsten!$A$1:$C$343,2,FALSE))","v":"BOOV"},{"$f":"IF(ISBLANK($C47),\"\",VLOOKUP($C47,Lijsten!$A$1:$C$343,3,FALSE))","v":"03100"},"boomvalk",null,null,null,null,null,""]
[{"$f":"IF(ISBLANK($C48),\"\",VLOOKUP($C48,Lijsten!$A$1:$C$343,2,FALSE))","v":"SLEV"},{"$f":"IF(ISBLANK($C48),\"\",VLOOKUP($C48,Lijsten!$A$1:$C$343,3,FALSE))","v":"03200"},"slechtvalk",null,null,null,null,null,""]
[{"$f":"IF(ISBLANK($C49),\"\",VLOOKUP($C49,Lijsten!$A$1:$C$343,2,FALSE))","v":"FAZA"},{"$f":"IF(ISBLANK($C49),\"\",VLOOKUP($C49,Lijsten!$A$1:$C$343,3,FALSE))","v":"03940"},"fazant",null,null,null,null,null,""]
[{"$f":"IF(ISBLANK($C50),\"\",VLOOKUP($C50,Lijsten!$A$1:$C$343,2,FALSE))","v":"WRAL"},{"$f":"IF(ISBLANK($C50),\"\",VLOOKUP($C50,Lijsten!$A$1:$C$343,3,FALSE))","v":"04070"},"waterral",null,null,null,null,null,""]
[{"$f":"IF(ISBLANK($C51),\"\",VLOOKUP($C51,Lijsten!$A$1:$C$343,2,FALSE))","v":"WAHO"},{"$f":"IF(ISBLANK($C51),\"\",VLOOKUP($C51,Lijsten!$A$1:$C$343,3,FALSE))","v":"04240"},"waterhoen",null,null,null,null,null,""]
[{"$f":"IF(ISBLANK($C52),\"\",VLOOKUP($C52,Lijsten!$A$1:$C$343,2,FALSE))","v":"MEKO"},{"$f":"IF(ISBLANK($C52),\"\",VLOOKUP($C52,Lijsten!$A$1:$C$343,3,FALSE))","v":"04290"},"meerkoet",null,null,null,null,null,""]
[{"$f":"IF(ISBLANK($C53),\"\",VLOOKUP($C53,Lijsten!$A$1:$C$343,2,FALSE))","v":"SCHO"},{"$f":"IF(ISBLANK($C53),\"\",VLOOKUP($C53,Lijsten!$A$1:$C$343,3,FALSE))","v":"04500"},"scholekster",null,null,null,null,null,""]
[{"$f":"IF(ISBLANK($C54),\"\",VLOOKUP($C54,Lijsten!$A$1:$C$343,2,FALSE))","v":"GOPL"},{"$f":"IF(ISBLANK($C54),\"\",VLOOKUP($C54,Lijsten!$A$1:$C$343,3,FALSE))","v":"04850"},"goudplevier",null,null,null,null,null,""]
[{"$f":"IF(ISBLANK($C55),\"\",VLOOKUP($C55,Lijsten!$A$1:$C$343,2,FALSE))","v":"KIEV"},{"$f":"IF(ISBLANK($C55),\"\",VLOOKUP($C55,Lijsten!$A$1:$C$343,3,FALSE))","v":"04930"},"kievit",null,null,null,null,null,""]
[{"$f":"IF(ISBLANK($C56),\"\",VLOOKUP($C56,Lijsten!$A$1:$C$343,2,FALSE))","v":"KEMP"},{"$f":"IF(ISBLANK($C56),\"\",VLOOKUP($C56,Lijsten!$A$1:$C$343,3,FALSE))","v":"05170"},"kemphaan",null,null,null,null,null,""]
[{"$f":"IF(ISBLANK($C57),\"\",VLOOKUP($C57,Lijsten!$A$1:$C$343,2,FALSE))","v":"WATS"},{"$f":"IF(ISBLANK($C57),\"\",VLOOKUP($C57,Lijsten!$A$1:$C$343,3,FALSE))","v":"05190"},"watersnip",null,null,null,null,null,""]
[{"$f":"IF(ISBLANK($C58),\"\",VLOOKUP($C58,Lijsten!$A$1:$C$343,2,FALSE))","v":"GRUT"},{"$f":"IF(ISBLANK($C58),\"\",VLOOKUP($C58,Lijsten!$A$1:$C$343,3,FALSE))","v":"05320"},"grutto",null,null,null,null,null,""]
[{"$f":"IF(ISBLANK($C59),\"\",VLOOKUP($C59,Lijsten!$A$1:$C$343,2,FALSE))","v":"WULP"},{"$f":"IF(ISBLANK($C59),\"\",VLOOKUP($C59,Lijsten!$A$1:$C$343,3,FALSE))","v":"05410"},"wulp",null,null,null,null,null,""]
[{"$f":"IF(ISBLANK($C60),\"\",VLOOKUP($C60,Lijsten!$A$1:$C$343,2,FALSE))","v":"TURE"},{"$f":"IF(ISBLANK($C60),\"\",VLOOKUP($C60,Lijsten!$A$1:$C$343,3,FALSE))","v":"05460"},"tureluur",null,null,null,null,null,""]
[{"$f":"IF(ISBLANK($C61),\"\",VLOOKUP($C61,Lijsten!$A$1:$C$343,2,FALSE))","v":"WITG"},{"$f":"IF(ISBLANK($C61),\"\",VLOOKUP($C61,Lijsten!$A$1:$C$343,3,FALSE))","v":"05530"},"witgatje",null,null,null,null,null,""]
[{"$f":"IF(ISBLANK($C62),\"\",VLOOKUP($C62,Lijsten!$A$1:$C$343,2,FALSE))","v":"KOKM"},{"$f":"IF(ISBLANK($C62),\"\",VLOOKUP($C62,Lijsten!$A$1:$C$343,3,FALSE))","v":"05820"},"kokmeeuw",null,null,null,null,null,""]
[{"$f":"IF(ISBLANK($C63),\"\",VLOOKUP($C63,Lijsten!$A$1:$C$343,2,FALSE))","v":"STOM"},{"$f":"IF(ISBLANK($C63),\"\",VLOOKUP($C63,Lijsten!$A$1:$C$343,3,FALSE))","v":"05900"},"stormmeeuw",null,null,null,null,null,""]
[{"$f":"IF(ISBLANK($C64),\"\",VLOOKUP($C64,Lijsten!$A$1:$C$343,2,FALSE))","v":"KMAN"},{"$f":"IF(ISBLANK($C64),\"\",VLOOKUP($C64,Lijsten!$A$1:$C$343,3,FALSE))","v":"05910"},"kleine mantelmeeuw",null,null,null,null,null,""]
[{"$f":"IF(ISBLANK($C65),\"\",VLOOKUP($C65,Lijsten!$A$1:$C$343,2,FALSE))","v":"ZILM"},{"$f":"IF(ISBLANK($C65),\"\",VLOOKUP($C65,Lijsten!$A$1:$C$343,3,FALSE))","v":"05920"},"zilvermeeuw",null,null,null,null,null,""]
[{"$f":"IF(ISBLANK($C66),\"\",VLOOKUP($C66,Lijsten!$A$1:$C$343,2,FALSE))","v":"GMAN"},{"$f":"IF(ISBLANK($C66),\"\",VLOOKUP($C66,Lijsten!$A$1:$C$343,3,FALSE))","v":"06000"},"grote mantelmeeuw",null,null,null,null,null,""]
[{"$f":"IF(ISBLANK($C67),\"\",VLOOKUP($C67,Lijsten!$A$1:$C$343,2,FALSE))","v":"HOLD"},{"$f":"IF(ISBLANK($C67),\"\",VLOOKUP($C67,Lijsten!$A$1:$C$343,3,FALSE))","v":"06680"},"holenduif",null,null,null,null,null,""]
[{"$f":"IF(ISBLANK($C68),\"\",VLOOKUP($C68,Lijsten!$A$1:$C$343,2,FALSE))","v":"HODU"},{"$f":"IF(ISBLANK($C68),\"\",VLOOKUP($C68,Lijsten!$A$1:$C$343,3,FALSE))","v":"06700"},"houtduif",null,null,null,null,null,""]
[{"$f":"IF(ISBLANK($C69),\"\",VLOOKUP($C69,Lijsten!$A$1:$C$343,2,FALSE))","v":"TUTO"},{"$f":"IF(ISBLANK($C69),\"\",VLOOKUP($C69,Lijsten!$A$1:$C$343,3,FALSE))","v":"06840"},"turkse tortel",null,null,null,null,null,""]
[{"$f":"IF(ISBLANK($C70),\"\",VLOOKUP($C70,Lijsten!$A$1:$C$343,2,FALSE))","v":"GRBS"},{"$f":"IF(ISBLANK($C70),\"\",VLOOKUP($C70,Lijsten!$A$1:$C$343,3,FALSE))","v":"08760"},"grote bonte specht",null,null,null,null,null,""]
[{"$f":"IF(ISBLANK($C71),\"\",VLOOKUP($C71,Lijsten!$A$1:$C$343,2,FALSE))","v":"VELD"},{"$f":"IF(ISBLANK($C71),\"\",VLOOKUP($C71,Lijsten!$A$1:$C$343,3,FALSE))","v":"09760"},"veldleeuwerik",null,null,null,null,null,""]
[{"$f":"IF(ISBLANK($C72),\"\",VLOOKUP($C72,Lijsten!$A$1:$C$343,2,FALSE))","v":"BOZW"},{"$f":"IF(ISBLANK($C72),\"\",VLOOKUP($C72,Lijsten!$A$1:$C$343,3,FALSE))","v":"09920"},"boerenzwaluw",null,null,null,null,null,""]
[{"$f":"IF(ISBLANK($C73),\"\",VLOOKUP($C73,Lijsten!$A$1:$C$343,2,FALSE))","v":"GRAP"},{"$f":"IF(ISBLANK($C73),\"\",VLOOKUP($C73,Lijsten!$A$1:$C$343,3,FALSE))","v":"10110"},"graspieper",null,null,null,null,null,""]
[{"$f":"IF(ISBLANK($C74),\"\",VLOOKUP($C74,Lijsten!$A$1:$C$343,2,FALSE))","v":"WIKW"},{"$f":"IF(ISBLANK($C74),\"\",VLOOKUP($C74,Lijsten!$A$1:$C$343,3,FALSE))","v":10201},"witte kwikstaart",null,null,null,null,null,""]
[{"$f":"IF(ISBLANK($C75),\"\",VLOOKUP($C75,Lijsten!$A$1:$C$343,2,FALSE))","v":"WIKO"},{"$f":"IF(ISBLANK($C75),\"\",VLOOKUP($C75,Lijsten!$A$1:$C$343,3,FALSE))","v":"10660"},"winterkoning",null,null,null,null,null,""]
[{"$f":"IF(ISBLANK($C76),\"\",VLOOKUP($C76,Lijsten!$A$1:$C$343,2,FALSE))","v":"HEG"},{"$f":"IF(ISBLANK($C76),\"\",VLOOKUP($C76,Lijsten!$A$1:$C$343,3,FALSE))","v":"10840"},"heggenmus",null,null,null,null,null,""]
[{"$f":"IF(ISBLANK($C77),\"\",VLOOKUP($C77,Lijsten!$A$1:$C$343,2,FALSE))","v":"ROBO"},{"$f":"IF(ISBLANK($C77),\"\",VLOOKUP($C77,Lijsten!$A$1:$C$343,3,FALSE))","v":"10990"},"roodborst",null,null,null,null,null,""]
[{"$f":"IF(ISBLANK($C78),\"\",VLOOKUP($C78,Lijsten!$A$1:$C$343,2,FALSE))","v":"PAAP"},{"$f":"IF(ISBLANK($C78),\"\",VLOOKUP($C78,Lijsten!$A$1:$C$343,3,FALSE))","v":"11370"},"paapje",null,null,null,null,null,{"$f":"IF(AND(OR(D78=\"\",ISNUMBER(D78)),OR(E78=\"\",ISNUMBER(E78)),OR(F78=\"\",ISNUMBER(F78)),OR(G78=\"\",ISNUMBER(G78)),NOT((E78+F78+G78)>D78)),\"\",\"FOUT\")","v":""}]
[{"$f":"IF(ISBLANK($C79),\"\",VLOOKUP($C79,Lijsten!$A$1:$C$343,2,FALSE))","v":"ROBT"},{"$f":"IF(ISBLANK($C79),\"\",VLOOKUP($C79,Lijsten!$A$1:$C$343,3,FALSE))","v":"11390"},"roodborsttapuit",null,null,null,null,null,""]
[{"$f":"IF(ISBLANK($C80),\"\",VLOOKUP($C80,Lijsten!$A$1:$C$343,2,FALSE))","v":"TAPU"},{"$f":"IF(ISBLANK($C80),\"\",VLOOKUP($C80,Lijsten!$A$1:$C$343,3,FALSE))","v":"11460"},"tapuit",null,null,null,null,null,""]
[{"$f":"IF(ISBLANK($C81),\"\",VLOOKUP($C81,Lijsten!$A$1:$C$343,2,FALSE))","v":"MERE"},{"$f":"IF(ISBLANK($C81),\"\",VLOOKUP($C81,Lijsten!$A$1:$C$343,3,FALSE))","v":"11870"},"merel",null,null,null,null,null,""]
[{"$f":"IF(ISBLANK($C82),\"\",VLOOKUP($C82,Lijsten!$A$1:$C$343,2,FALSE))","v":"KRAM"},{"$f":"IF(ISBLANK($C82),\"\",VLOOKUP($C82,Lijsten!$A$1:$C$343,3,FALSE))","v":"11980"},"kramsvogel",null,null,null,null,null,""]
[{"$f":"IF(ISBLANK($C83),\"\",VLOOKUP($C83,Lijsten!$A$1:$C$343,2,FALSE))","v":"KOPW"},{"$f":"IF(ISBLANK($C83),\"\",VLOOKUP($C83,Lijsten!$A$1:$C$343,3,FALSE))","v":"12010"},"koperwiek",null,null,null,null,null,""]
[{"$f":"IF(ISBLANK($C84),\"\",VLOOKUP($C84,Lijsten!$A$1:$C$343,2,FALSE))","v":"TJIF"},{"$f":"IF(ISBLANK($C84),\"\",VLOOKUP($C84,Lijsten!$A$1:$C$343,3,FALSE))","v":"13110"},"tjiftjaf",null,null,null,null,null,""]
[{"$f":"IF(ISBLANK($C85),\"\",VLOOKUP($C85,Lijsten!$A$1:$C$343,2,FALSE))","v":"BAAR"},{"$f":"IF(ISBLANK($C85),\"\",VLOOKUP($C85,Lijsten!$A$1:$C$343,3,FALSE))","v":"13640"},"baardmannetje",null,null,null,null,null,""]
[{"$f":"IF(ISBLANK($C86),\"\",VLOOKUP($C86,Lijsten!$A$1:$C$343,2,FALSE))","v":"STAM"},{"$f":"IF(ISBLANK($C86),\"\",VLOOKUP($C86,Lijsten!$A$1:$C$343,3,FALSE))","v":14374},"staartmees",null,null,null,null,null,""]
[{"$f":"IF(ISBLANK($C87),\"\",VLOOKUP($C87,Lijsten!$A$1:$C$343,2,FALSE))","v":"PIME"},{"$f":"IF(ISBLANK($C87),\"\",VLOOKUP($C87,Lijsten!$A$1:$C$343,3,FALSE))","v":"14620"},"pimpelmees",null,null,null,null,null,""]
[{"$f":"IF(ISBLANK($C88),\"\",VLOOKUP($C88,Lijsten!$A$1:$C$343,2,FALSE))","v":"KOME"},{"$f":"IF(ISBLANK($C88),\"\",VLOOKUP($C88,Lijsten!$A$1:$C$343,3,FALSE))","v":"14640"},"koolmees",null,null,null,null,null,""]
[{"$f":"IF(ISBLANK($C89),\"\",VLOOKUP($C89,Lijsten!$A$1:$C$343,2,FALSE))","v":"BOOK"},{"$f":"IF(ISBLANK($C89),\"\",VLOOKUP($C89,Lijsten!$A$1:$C$343,3,FALSE))","v":"14870"},"boomkruiper",null,null,null,null,null,""]
[{"$f":"IF(ISBLANK($C90),\"\",VLOOKUP($C90,Lijsten!$A$1:$C$343,2,FALSE))","v":"VLAG"},{"$f":"IF(ISBLANK($C90),\"\",VLOOKUP($C90,Lijsten!$A$1:$C$343,3,FALSE))","v":"15390"},"gaai",null,null,null,null,null,""]
[{"$f":"IF(ISBLANK($C91),\"\",VLOOKUP($C91,Lijsten!$A$1:$C$343,2,FALSE))","v":"EKST"},{"$f":"IF(ISBLANK($C91),\"\",VLOOKUP($C91,Lijsten!$A$1:$C$343,3,FALSE))","v":"15490"},"ekster",null,null,null,null,null,""]
[{"$f":"IF(ISBLANK($C92),\"\",VLOOKUP($C92,Lijsten!$A$1:$C$343,2,FALSE))","v":"KAUW"},{"$f":"IF(ISBLANK($C92),\"\",VLOOKUP($C92,Lijsten!$A$1:$C$343,3,FALSE))","v":"15600"},"kauw",null,null,null,null,null,""]
[{"$f":"IF(ISBLANK($C93),\"\",VLOOKUP($C93,Lijsten!$A$1:$C$343,2,FALSE))","v":"ZWKR"},{"$f":"IF(ISBLANK($C93),\"\",VLOOKUP($C93,Lijsten!$A$1:$C$343,3,FALSE))","v":15671},"zwarte kraai",null,null,null,null,null,""]
[{"$f":"IF(ISBLANK($C94),\"\",VLOOKUP($C94,Lijsten!$A$1:$C$343,2,FALSE))","v":"SPRE"},{"$f":"IF(ISBLANK($C94),\"\",VLOOKUP($C94,Lijsten!$A$1:$C$343,3,FALSE))","v":"15820"},"spreeuw",null,null,null,null,null,""]
[{"$f":"IF(ISBLANK($C95),\"\",VLOOKUP($C95,Lijsten!$A$1:$C$343,2,FALSE))","v":"VINK"},{"$f":"IF(ISBLANK($C95),\"\",VLOOKUP($C95,Lijsten!$A$1:$C$343,3,FALSE))","v":"16360"},"vink",null,null,null,null,null,""]
[{"$f":"IF(ISBLANK($C96),\"\",VLOOKUP($C96,Lijsten!$A$1:$C$343,2,FALSE))","v":"GRLI"},{"$f":"IF(ISBLANK($C96),\"\",VLOOKUP($C96,Lijsten!$A$1:$C$343,3,FALSE))","v":"16490"},"groenling",null,null,null,null,null,""]
[{"$f":"IF(ISBLANK($C97),\"\",VLOOKUP($C97,Lijsten!$A$1:$C$343,2,FALSE))","v":"PUT"},{"$f":"IF(ISBLANK($C97),\"\",VLOOKUP($C97,Lijsten!$A$1:$C$343,3,FALSE))","v":"16530"},"putter",null,null,null,null,null,""]
[{"$f":"IF(ISBLANK($C98),\"\",VLOOKUP($C98,Lijsten!$A$1:$C$343,2,FALSE))","v":"SIJS"},{"$f":"IF(ISBLANK($C98),\"\",VLOOKUP($C98,Lijsten!$A$1:$C$343,3,FALSE))","v":"16540"},"sijs",null,null,null,null,null,""]
[{"$f":"IF(ISBLANK($C99),\"\",VLOOKUP($C99,Lijsten!$A$1:$C$343,2,FALSE))","v":"RIGO"},{"$f":"IF(ISBLANK($C99),\"\",VLOOKUP($C99,Lijsten!$A$1:$C$343,3,FALSE))","v":18770},"rietgors",null,null,null,null,null,""]
[{"$f":"IF(ISBLANK($C100),\"\",VLOOKUP($C100,Lijsten!$A$1:$C$343,2,FALSE))","v":""},{"$f":"IF(ISBLANK($C100),\"\",VLOOKUP($C100,Lijsten!$A$1:$C$343,3,FALSE))","v":""},null,null,null,null,null,null,""]
[{"$f":"IF(ISBLANK($C101),\"\",VLOOKUP($C101,Lijsten!$A$1:$C$343,2,FALSE))","v":""},{"$f":"IF(ISBLANK($C101),\"\",VLOOKUP($C101,Lijsten!$A$1:$C$343,3,FALSE))","v":""},null,null,null,null,null,null,""]
[{"$f":"IF(ISBLANK($C102),\"\",VLOOKUP($C102,Lijsten!$A$1:$C$343,2,FALSE))","v":""},{"$f":"IF(ISBLANK($C102),\"\",VLOOKUP($C102,Lijsten!$A$1:$C$343,3,FALSE))","v":""},null,null,null,null,null,null,""]
[{"$f":"IF(ISBLANK($C103),\"\",VLOOKUP($C103,Lijsten!$A$1:$C$343,2,FALSE))","v":""},{"$f":"IF(ISBLANK($C103),\"\",VLOOKUP($C103,Lijsten!$A$1:$C$343,3,FALSE))","v":""},null,null,null,null,null,null,""]
[{"$f":"IF(ISBLANK($C104),\"\",VLOOKUP($C104,Lijsten!$A$1:$C$343,2,FALSE))","v":""},{"$f":"IF(ISBLANK($C104),\"\",VLOOKUP($C104,Lijsten!$A$1:$C$343,3,FALSE))","v":""},null,null,null,null,null,null,""]
[{"$f":"IF(ISBLANK($C105),\"\",VLOOKUP($C105,Lijsten!$A$1:$C$343,2,FALSE))","v":""},{"$f":"IF(ISBLANK($C105),\"\",VLOOKUP($C105,Lijsten!$A$1:$C$343,3,FALSE))","v":""},null,null,null,null,null,null,""]
[{"$f":"IF(ISBLANK($C106),\"\",VLOOKUP($C106,Lijsten!$A$1:$C$343,2,FALSE))","v":""},{"$f":"IF(ISBLANK($C106),\"\",VLOOKUP($C106,Lijsten!$A$1:$C$343,3,FALSE))","v":""},null,null,null,null,null,null,""]
[{"$f":"IF(ISBLANK($C107),\"\",VLOOKUP($C107,Lijsten!$A$1:$C$343,2,FALSE))","v":""},{"$f":"IF(ISBLANK($C107),\"\",VLOOKUP($C107,Lijsten!$A$1:$C$343,3,FALSE))","v":""},null,null,null,null,null,null,""]
[{"$f":"IF(ISBLANK($C108),\"\",VLOOKUP($C108,Lijsten!$A$1:$C$343,2,FALSE))","v":""},{"$f":"IF(ISBLANK($C108),\"\",VLOOKUP($C108,Lijsten!$A$1:$C$343,3,FALSE))","v":""},null,null,null,null,null,null,""]
[{"$f":"IF(ISBLANK($C109),\"\",VLOOKUP($C109,Lijsten!$A$1:$C$343,2,FALSE))","v":""},{"$f":"IF(ISBLANK($C109),\"\",VLOOKUP($C109,Lijsten!$A$1:$C$343,3,FALSE))","v":""},null,null,null,null,null,null,""]
[{"$f":"IF(ISBLANK($C110),\"\",VLOOKUP($C110,Lijsten!$A$1:$C$343,2,FALSE))","v":""},{"$f":"IF(ISBLANK($C110),\"\",VLOOKUP($C110,Lijsten!$A$1:$C$343,3,FALSE))","v":""},null,null,null,null,null,null,""]
[{"$f":"IF(ISBLANK($C111),\"\",VLOOKUP($C111,Lijsten!$A$1:$C$343,2,FALSE))","v":""},{"$f":"IF(ISBLANK($C111),\"\",VLOOKUP($C111,Lijsten!$A$1:$C$343,3,FALSE))","v":""},null,null,null,null,null,null,""]
[{"$f":"IF(ISBLANK($C112),\"\",VLOOKUP($C112,Lijsten!$A$1:$C$343,2,FALSE))","v":""},{"$f":"IF(ISBLANK($C112),\"\",VLOOKUP($C112,Lijsten!$A$1:$C$343,3,FALSE))","v":""},null,null,null,null,null,null,""]
[{"$f":"IF(ISBLANK($C113),\"\",VLOOKUP($C113,Lijsten!$A$1:$C$343,2,FALSE))","v":""},{"$f":"IF(ISBLANK($C113),\"\",VLOOKUP($C113,Lijsten!$A$1:$C$343,3,FALSE))","v":""},null,null,null,null,null,null,""]
[{"$f":"IF(ISBLANK($C114),\"\",VLOOKUP($C114,Lijsten!$A$1:$C$343,2,FALSE))","v":""},{"$f":"IF(ISBLANK($C114),\"\",VLOOKUP($C114,Lijsten!$A$1:$C$343,3,FALSE))","v":""},null,null,null,null,null,null,""]
[{"$f":"IF(ISBLANK($C115),\"\",VLOOKUP($C115,Lijsten!$A$1:$C$343,2,FALSE))","v":""},{"$f":"IF(ISBLANK($C115),\"\",VLOOKUP($C115,Lijsten!$A$1:$C$343,3,FALSE))","v":""},null,null,null,null,null,null,""]
[{"$f":"IF(ISBLANK($C116),\"\",VLOOKUP($C116,Lijsten!$A$1:$C$343,2,FALSE))","v":""},{"$f":"IF(ISBLANK($C116),\"\",VLOOKUP($C116,Lijsten!$A$1:$C$343,3,FALSE))","v":""},null,null,null,null,null,null,""]
[{"$f":"IF(ISBLANK($C117),\"\",VLOOKUP($C117,Lijsten!$A$1:$C$343,2,FALSE))","v":""},{"$f":"IF(ISBLANK($C117),\"\",VLOOKUP($C117,Lijsten!$A$1:$C$343,3,FALSE))","v":""},null,null,null,null,null,null,""]
[{"$f":"IF(ISBLANK($C118),\"\",VLOOKUP($C118,Lijsten!$A$1:$C$343,2,FALSE))","v":""},{"$f":"IF(ISBLANK($C118),\"\",VLOOKUP($C118,Lijsten!$A$1:$C$343,3,FALSE))","v":""},null,null,null,null,null,null,""]
[{"$f":"IF(ISBLANK($C119),\"\",VLOOKUP($C119,Lijsten!$A$1:$C$343,2,FALSE))","v":""},{"$f":"IF(ISBLANK($C119),\"\",VLOOKUP($C119,Lijsten!$A$1:$C$343,3,FALSE))","v":""},null,null,null,null,null,null,""]
[{"$f":"IF(ISBLANK($C120),\"\",VLOOKUP($C120,Lijsten!$A$1:$C$343,2,FALSE))","v":""},{"$f":"IF(ISBLANK($C120),\"\",VLOOKUP($C120,Lijsten!$A$1:$C$343,3,FALSE))","v":""},null,null,null,null,null,null,""]
[{"$f":"IF(ISBLANK($C121),\"\",VLOOKUP($C121,Lijsten!$A$1:$C$343,2,FALSE))","v":""},{"$f":"IF(ISBLANK($C121),\"\",VLOOKUP($C121,Lijsten!$A$1:$C$343,3,FALSE))","v":""},null,null,null,null,null,null,""]
[{"$f":"IF(ISBLANK($C122),\"\",VLOOKUP($C122,Lijsten!$A$1:$C$343,2,FALSE))","v":""},{"$f":"IF(ISBLANK($C122),\"\",VLOOKUP($C122,Lijsten!$A$1:$C$343,3,FALSE))","v":""},null,null,null,null,null,null,""]
[{"$f":"IF(ISBLANK($C123),\"\",VLOOKUP($C123,Lijsten!$A$1:$C$343,2,FALSE))","v":""},{"$f":"IF(ISBLANK($C123),\"\",VLOOKUP($C123,Lijsten!$A$1:$C$343,3,FALSE))","v":""},null,null,null,null,null,null,""]
[{"$f":"IF(ISBLANK($C124),\"\",VLOOKUP($C124,Lijsten!$A$1:$C$343,2,FALSE))","v":""},{"$f":"IF(ISBLANK($C124),\"\",VLOOKUP($C124,Lijsten!$A$1:$C$343,3,FALSE))","v":""},null,null,null,null,null,null,""]
[{"$f":"IF(ISBLANK($C125),\"\",VLOOKUP($C125,Lijsten!$A$1:$C$343,2,FALSE))","v":""},{"$f":"IF(ISBLANK($C125),\"\",VLOOKUP($C125,Lijsten!$A$1:$C$343,3,FALSE))","v":""},null,null,null,null,null,null,""]
[{"$f":"IF(ISBLANK($C126),\"\",VLOOKUP($C126,Lijsten!$A$1:$C$343,2,FALSE))","v":""},{"$f":"IF(ISBLANK($C126),\"\",VLOOKUP($C126,Lijsten!$A$1:$C$343,3,FALSE))","v":""},null,null,null,null,null,null,""]
[{"$f":"IF(ISBLANK($C127),\"\",VLOOKUP($C127,Lijsten!$A$1:$C$343,2,FALSE))","v":""},{"$f":"IF(ISBLANK($C127),\"\",VLOOKUP($C127,Lijsten!$A$1:$C$343,3,FALSE))","v":""},null,null,null,null,null,null,""]
[{"$f":"IF(ISBLANK($C128),\"\",VLOOKUP($C128,Lijsten!$A$1:$C$343,2,FALSE))","v":""},{"$f":"IF(ISBLANK($C128),\"\",VLOOKUP($C128,Lijsten!$A$1:$C$343,3,FALSE))","v":""},null,null,null,null,null,null,""]
[{"$f":"IF(ISBLANK($C129),\"\",VLOOKUP($C129,Lijsten!$A$1:$C$343,2,FALSE))","v":""},{"$f":"IF(ISBLANK($C129),\"\",VLOOKUP($C129,Lijsten!$A$1:$C$343,3,FALSE))","v":""},null,null,null,null,null,null,""]
[{"$f":"IF(ISBLANK($C130),\"\",VLOOKUP($C130,Lijsten!$A$1:$C$343,2,FALSE))","v":""},{"$f":"IF(ISBLANK($C130),\"\",VLOOKUP($C130,Lijsten!$A$1:$C$343,3,FALSE))","v":""},null,null,null,null,null,null,""]
[{"$f":"IF(ISBLANK($C131),\"\",VLOOKUP($C131,Lijsten!$A$1:$C$343,2,FALSE))","v":""},{"$f":"IF(ISBLANK($C131),\"\",VLOOKUP($C131,Lijsten!$A$1:$C$343,3,FALSE))","v":""},null,null,null,null,null,null,""]
[{"$f":"IF(ISBLANK($C132),\"\",VLOOKUP($C132,Lijsten!$A$1:$C$343,2,FALSE))","v":""},{"$f":"IF(ISBLANK($C132),\"\",VLOOKUP($C132,Lijsten!$A$1:$C$343,3,FALSE))","v":""},null,null,null,null,null,null,""]
[{"$f":"IF(ISBLANK($C133),\"\",VLOOKUP($C133,Lijsten!$A$1:$C$343,2,FALSE))","v":""},{"$f":"IF(ISBLANK($C133),\"\",VLOOKUP($C133,Lijsten!$A$1:$C$343,3,FALSE))","v":""},null,null,null,null,null,null,""]
[{"$f":"IF(ISBLANK($C134),\"\",VLOOKUP($C134,Lijsten!$A$1:$C$343,2,FALSE))","v":""},{"$f":"IF(ISBLANK($C134),\"\",VLOOKUP($C134,Lijsten!$A$1:$C$343,3,FALSE))","v":""},null,null,null,null,null,null,""]
[{"$f":"IF(ISBLANK($C135),\"\",VLOOKUP($C135,Lijsten!$A$1:$C$343,2,FALSE))","v":""},{"$f":"IF(ISBLANK($C135),\"\",VLOOKUP($C135,Lijsten!$A$1:$C$343,3,FALSE))","v":""},null,null,null,null,null,null,""]
[{"$f":"IF(ISBLANK($C136),\"\",VLOOKUP($C136,Lijsten!$A$1:$C$343,2,FALSE))","v":""},{"$f":"IF(ISBLANK($C136),\"\",VLOOKUP($C136,Lijsten!$A$1:$C$343,3,FALSE))","v":""},null,null,null,null,null,null,""]
[{"$f":"IF(ISBLANK($C137),\"\",VLOOKUP($C137,Lijsten!$A$1:$C$343,2,FALSE))","v":""},{"$f":"IF(ISBLANK($C137),\"\",VLOOKUP($C137,Lijsten!$A$1:$C$343,3,FALSE))","v":""},null,null,null,null,null,null,""]
[{"$f":"IF(ISBLANK($C138),\"\",VLOOKUP($C138,Lijsten!$A$1:$C$343,2,FALSE))","v":""},{"$f":"IF(ISBLANK($C138),\"\",VLOOKUP($C138,Lijsten!$A$1:$C$343,3,FALSE))","v":""},null,null,null,null,null,null,""]
[{"$f":"IF(ISBLANK($C139),\"\",VLOOKUP($C139,Lijsten!$A$1:$C$343,2,FALSE))","v":""},{"$f":"IF(ISBLANK($C139),\"\",VLOOKUP($C139,Lijsten!$A$1:$C$343,3,FALSE))","v":""},null,null,null,null,null,null,""]
[{"$f":"IF(ISBLANK($C140),\"\",VLOOKUP($C140,Lijsten!$A$1:$C$343,2,FALSE))","v":""},{"$f":"IF(ISBLANK($C140),\"\",VLOOKUP($C140,Lijsten!$A$1:$C$343,3,FALSE))","v":""},null,null,null,null,null,null,""]

{"sheet":"Algemene instructies","index":1,"n_rows":25,"n_cols":1,"rows_kept":25,"cut":false,"hidden":false,"merged":[]}
["Algemeen"]
["Dit formulier kunt u gebruiken voor het electronisch doorgeven van de telgegevens aan de Vogelwacht. Bij de Vogelwacht wordt het formulier automatisch geimporteerd in een database. Om dit importeren goed te laten verlpen, is het van belang om niets aan het formulier te veranderen (zie ook kopje Beveiliging).\nVoor een beschrijving van de in te vullen velden kunt u het tabblad \"Veld instructies\" lezen. Hier wordt per veld beschreven wat er ingevoerd dient te worden.\nDe volgorde waarop u de vogels invoert bij gebruik van een leeg sjabloon (zie kopje \"Versies\") is niet van invloed op het importeren. Hier bent u dus vrij in."]
[]
["Inzending"]
["U kunt het ingevulde formulier opslaan en per e-mail opsturen naar de coördinator via het e-mail adres wintertelling@vogelwachtzaanstreek.nl. Om de verwerking eenvoudiger te maken wordt u verzocht de gebiedscode en datum van de telling op te nemen in de bestandsnaam. (bijv. 20060915 KWN.xls)"]
[]
["Beveiliging"]
["Om het importeren van de gegevens goed te kunnen laten verlopen, is het van groot belang dat er niets veranderd wordt aan het formulier. Om veranderingen te voorkomen is een groot deel van het formulier dan ook beveiligd. Wanneer u hier iets probeert in te voeren of te verwijderen, zult u een melding krijgen dat dit onmogelijk is. Sommige operaties (bijv. rij invoegen) zijn echter ondanks de beveiliging nog wel mogelijk. U wordt dringend verzocht deze NIET uit te voeren. Mocht u per ongeluk een rij verkeerd invoeren (bijv. een verkeerde vogel selecteren), voer de juiste gegevens dan gewoon over de foutieve waarden in."]
[]
["Verplichte velden en macro waarschuwing"]
["Een aantal velden op het telformulier zijn verplicht in te voeren. Deze zijn voorzien van een rood kader in de koptitel (bijv. Gebied). Deze velden maken een telformulier uniek binnen de database waarin ze geimporteerd worden. Wanneer u een formulier wilt opslaan met een van de verplichte velden nog niet ingevoerd. Dan zult u een melding krijgen dat dit niet mogelijk is !!\nHet afdwingen van de verplichte velden wordt uitgevoerd met behulp van een stukje macro-code. Daarom zult u bij het openen van het formulier een waarschuwing van Excel krijgen dat het bestand macro's bevat (exacte melding afhankelijk van de door u gebruikte versie). Hier heeft u de keuze om de macro's uit dan wel in te schakelen. Kies hier voor het INSCHAKELEN van macro's."]
[]
["Versienummer"]
["2.2.8"]
[]
["Versies"]
["Er zijn drie versies van dit telformulier beschikbaar."]
["1. Standaard formulier - Het telformulier waarbij de vogelsoorten die in de Zaanstreek het meest waargenomen worden, reeds zijn ingevoerd. Eventuele soorten die niet op het formulier staan, kunnen zelf toegevoegd worden."]
["2. Uitgebreid formulier - Een telformulier met een uitgebreidere lijst van te voren ingevoerd vogels. Met name geschikt voor gebieden waar veel soorten voorkomen."]
["3. Leeg sjabloon - Alleen het kale formulier, de lijst met vogels is niet van te voren ingevoerd. Dit sjabloon is met name geschikt voor het zelf maken van een eigen standaard formulier. "]
[]
["Eigen sjabloon maken"]
["U kunt op basis van een van de standaard sjablonen (standaard, uitgebreid, leeg) een eigen sjabloon maken. Open hiertoe een van deze standaardsjablonen. Voer die gegevens die u altijd standaard ingevoerd wil hebben, in op het formulier (bijv. gebied en code waarnemer). U kunt eventueel een eigen lijst met veel getelde vogels samenstellen door in het lege standaard sjabloon een lijst met vogels te selecteren."]
["Wanneer het formulier zover ingevuld is dat u het altijd kunt gebruiken, slaat u het formulier op als sjabloon. Dit kan door middel van de menu keuze: bestand - opslaan als. Kies hier als bestandstype (opslaan als): Sjabloon (*.xlt), geef het bestand een naam en sla het op. Meer over het maken van een sjabloon is te vinden in de helpfunctie van Excel of in de bij de coordinator op te vragen handleiding."]
["LET OP ! Wanneer u zelf een sjabloon maakt, neem dan als basis altijd een van de bestaande sjablonen. Anders worden de verborgen bladen die gebruikt worden voor de import in de centrale database niet meegenomen !!"]

{"sheet":"Veld instructies","index":2,"n_rows":30,"n_cols":2,"rows_kept":30,"cut":false,"hidden":false,"merged":[]}
[]
["Gebied","Voer hier de gebiedscode in die u van de Vogelwacht heeft ontvangen"]
["Code waarnemer","Voor hier uw waarnemerscode in die u van de Vogelwacht heeft ontvangen. Mocht u met meerdere personen tellen, voer dan slechts één code in !! De andere tellers kunt u opnemen bij het veld notitie."]
["Datum","Voer de datum van de telling in. Gebruik hierbij het formaat dag - maand - jaar (dd-mm-jj)"]
["Begintijd","Voer de starttijd van de telling in. Gebruik hierbij het formaat uur : minuut (uu:mm)"]
["Eindtijd","Voer de eindtijd van de telling in. Gebruik hierbij het formaat uur : minuut (uu:mm)"]
["Windrichting","Voer hier de letter(combinatie) in van de windrichting (dus O, N, NO, etc.)"]
["Windkracht","Voer hier de windkracht in op de schaal van beaufort (1 , 2 , etc.)"]
["Temperatuur","Voer hier de temperatuur in graden Celcius in, noteer alleen het getal. Dus 15 en niet 15C."]
["Neerslag","Voer hier de hoeveelheid neerslag in. Maak eventueel gebruik van termen als bui, veel, etc."]
["Zicht","Kies een waarde uit de lijst."]
["Kijker","Voor hier de sterkte van uw kijker in (bijv. 8 x 40)"]
["Methode","Kies een waarde uit de lijst."]
["Telobject","Kies een waarde uit de lijst."]
["Bewolking","Kies een waarde uit de lijst. De bewolking wordt uitgedrukt in 8e delen (0/8 is onbewolkt, 8/8 geheel bewolkt)"]
["Waterstand","Voer hier de waterstand in. Wanneer de stand nergens afgelezen kan worden, maak dan gebruik van termen als (laag, normaal, hoog, etc.)"]
["Sneeuw","Geef aan of en eventueel hoeveel sneeuw er is."]
["IJs","Geef hier de eventuele ijsdekking aan, in percentages van bevroren oppervlakte, of met een andere duidelijke beschrijving"]
["Notitie","Voer hier eventueele opmerkingen in. Hier kunt u ook extra tellers opvoeren wanneer u met meerdere personen telt."]
[]
["Code","Dit veld wordt automatisch gevuld bij de invoer van een Nederlandse naam"]
["Nummer","Dit veld wordt automatisch gevuld bij de invoer van een Nederlandse naam"]
["Nederlandse naam","Selecteer een naam uit de lijst, of type deze volledig in. LET OP ! De naam moet volledig overeenkomen met een naam uit de lijst"]
["Totaal","Voer hier het aantal waargenomen exemplaren voor een soort in. Wanneer een vogel niet wordt waargenomen, dan 0 invoeren of het veld leeglaten. Het totaal aantal dient altijd hoger of gelijk te zijn dan het totaal van aantal man, vrouw en juveniele exemplaren."]
["Man","Voer hier het aantal mannelijke exemplaren in."]
["Vrouw","Voer hier het aantal vrouwlijke exemplaren in."]
["Juveniel","Voer hier het aantal juveniele exemplaren in."]
["Notitie","Ruimte voor een eventule opmerking. Hier graag niet te veel gebruik van maken."]
[]
[null,"Velden die met een rood kader zijn gemarkeerd, zijn verplicht om in te voeren. Wanneer een van deze velden niet is ingevoerd, kunt u het document niet opslaan."]

{"sheet":"Lijsten","index":3,"n_rows":343,"n_cols":7,"rows_kept":343,"cut":false,"hidden":true,"merged":[]}
["Aalscholver","AAL","00720",null,null,"Alle soorten",1]
["Alk","ALK","06360",null,null,"Water/Roofvogels",2]
["Alpengierzwaluw","ALPG","07980",null,null,"Water/Stelt/Roofvogels",3]
["Alpenheggemus","ALPH","10940",null,null,"Water/Stelt/Roofvogels/Meeuwen",4]
["Amerikaanse Kuifeend","AMKU","02000"]
["Amerikaanse Smient","AMSM","01800"]
["Appelvink","APVI","17170"]
["Arendbuizerd","AREB","02880",null,null,"Gebied doorkruist",1]
["Baardmannetje","BAAR","13640",null,null,"Randtelling",2]
["Barmsijs","BARM","16630"]
["Bastaardarend","BASA","02930"]
["Beflijster","BEFL","11860"]
["Bergeend","BERG","01730"]
["Bijeneter","BIJE","08400"]
["Bladkoninkje","BLAD","13000"]
["Blauwborst","BLBO",11060]
["Blauwe Kiekendief","BLKI","02610"]
["Blauwe Reiger","BLAR","01220"]
["Blauwvleugeltaling","BLAT","01920"]
["Boerenzwaluw","BOZW","09920"]
["Bokje","BOK","05180"]
["Bontbekplevier","BOPL","04700"]
["Bonte Kraai","BONK",15673]
["Bonte Strandloper","BSTR","05120"]
["Bonte Vliegenvanger","BOVL","13490"]
["Boomklever","BOKL","14790"]
["Boomkruiper","BOOK","14870"]
["Boomleeuwerik","BOLE","09740"]
["Boompieper","BOPI","10090"]
["Boomvalk","BOOV","03100"]
["Bosrietzanger","BORI","12500"]
["Bosruiter","BORU","05540"]
["Bosuil","BOSU","07610"]
["Braamsluiper","BRAA","12740"]
["Brandgans","BRAG","01670"]
["Brilduiker","BRIL","02180"]
["Brilzeeëend","BRZE","02140"]
["Bruine Kiekendief","BRKI","02600"]
["Buidelmees","BUIM","14900"]
["Buizerd","BUIZ","02870"]
["Canadese gans","CANG","01668"]
["Carolinaeend","CARO","01770"]
["Casarca","CASA","01710"]
["Cettis Zanger","CETZ","12200"]
["Chilitaling","CHTA","01911"]
["Dodaars","DODA","00070"]
["Draaihals","DRAH","08480"]
["Drieteenmeeuw","DRIM","06020"]
["Drieteenstrandloper","DSTR","04970"]
["Duikeend non det","DUKE","02099"]
["Duinpieper","DUPI","10050"]
["Dwergarend","DWEA","02980"]
["Dwerggans","DWEG","01600"]
["Dwergmeeuw","DWEM","05780"]
["Dwergstern","DWST","06240"]
["Eend non det","EEND","01899"]
["Eidereend","EIDE","02060"]
["Ekster","EKST","15490"]
["Engelse Gele Kwikstaart","EGKW","10172"]
["Europese Kanarie","EURK","16400"]
["Fazant","FAZA","03940"]
["Fitis","FITI","13120"]
["Flamingo","FLAM","01470"]
["Fluiter","FLUI","13080"]
["Frater","FRAT","16620"]
["Fuut","FUUT","00090"]
["Gaai","VLAG","15390"]
["Gans niet gedetermineerd","GANS","01720"]
["Geelpootmeeuw","GEPM","5928"]
["Geelsnavelduiker","GEED","00050"]
["Geen","GEEN","00000"]
["Gekraagde Roodstaart","GEKR","11220"]
["Gele Kwikstaart","GEKW","10171"]
["Geoorde Fuut","GEFU","00120"]
["Giervalk","GIEV","03180"]
["Gierzwaluw","GIER","07950"]
["Glanskop","GLAK","14400"]
["Goudfazant","GFAZ","03941"]
["Goudhaantje","GOUD","13140"]
["Goudplevier","GOPL","04850"]
["Goudvink","GOVI","17100"]
["Grasmus","GRAM","12750"]
["Graspieper","GRAP","10110"]
["Grauwe fitis","GRFI","12930"]
["Grauwe Franjepoot","GRAF","05640"]
["Grauwe Gans","GRAG","01610"]
["Grauwe gors","GRGO","18820"]
["Grauwe kiekendief","GRKI","02630"]
["Grauwe Klauwier","GRKL","15150"]
["Grauwe Vliegenvanger","GRVL","13350"]
["Grijze Wouw","GRWO","02350"]
["Groene Specht","GRSP","08560"]
["Groenling","GRLI","16490"]
["Groenpootruiter","GRNR","05480"]
["Grote Bonte Specht","GRBS","08760"]
["Grote burgemeester","GRBU","05990"]
["Grote Gele Kwikstaart","GGKW","10190"]
["Grote Jager","GROJ","05690"]
["Grote Karekiet","GRKA","12530"]
["Grote Lijster","GROL","12020"]
["Grote Mantelmeeuw","GMAN","06000"]
["Grote Pieper","GROP","10020"]
["Grote Stern","GRST","06110"]
["Grote trap","GRTR","04460"]
["Grote Zaagbek","GRZA","02230"]
["Grote Zeeëend","GRZE","02150"]
["Grote Zilverreiger","GRZR","01210"]
["Grutto","GRUT","05320"]
["Halsbandparkiet","HALS","07120"]
["Harlekijneend","HARL","02110"]
["Havik","HAVI","02670"]
["Havikarend","HAVA","02990"]
["Hazelhoen","HAZH","03260"]
["Heggenmus","HEG","10840"]
["Holenduif","HOLD","06680"]
["Hop","HOP","08460"]
["Houtduif","HODU","06700"]
["Houtsnip","HOUS","05290"]
["Huismus","HUMU","15910"]
["Huiszwaluw","HUZW","10010"]
["IJsduiker","IJSD","00040"]
["IJseend","IJSE","02120"]
["IJsgors","IJSG",18470]
["IJsvogel","IJSV","08310"]
["Indische gans","INDG","01620"]
["Jan van Gent","JVG","00710"]
["Kanoetstrandloper","KANS","04960"]
["Kauw","KAUW","15600"]
["Keep","KEEP","16380"]
["Keizerarend","KEIA","02950"]
["Keizersgans","KEIG","01650"]
["Kemphaan","KEMP","05170"]
["Kerkuil","KERK","07350"]
["Kievit","KIEV","04930"]
["Kip","KIP","0398"]
["Klapekster","KLAP","15200"]
["Klein waterhoen","KLWH","04100"]
["Kleine Alk","KLEA","06470"]
["Kleine Bonte Specht","KLBS","08870"]
["Kleine burgemeester","KLBU","05980"]
["Kleine jager","KLEJ","05670"]
["Kleine Karekiet","KLKA","12510"]
["Kleine Mantelmeeuw","KMAN","05910"]
["Kleine Plevier","KLPL","04690"]
["Kleine Rietgans","KLRG","01580"]
["Kleine Strandloper","KLST","05010"]
["Kleine trap","KLTR","04420"]
["Kleine Vliegenvanger","KLVL","13430"]
["Kleine zilverreiger","KLZR","01190"]
["Kleine Zwaan","KLZW","01530"]
["Kleinst Waterhoen","KLSW","04110"]
["Kleinste jager","KLSJ","05680"]
["Kluut","KLUU","04560"]
["Kneu","KNEU","16600"]
["Knobbelzwaan","KNOB","01520"]
["Koekoek","KOEK","07240"]
["Koereiger","KOER","01110"]
["Kokmeeuw","KOKM","05820"]
["Kolgans","KOLG","01590"]
["Koningseider","KONE","02070"]
["Koolmees","KOME","14640"]
["Koperwiek","KOPW","12010"]
["Korhoen","KORH","03320"]
["Kraagtrap","KRTR","04440"]
["Kraanvogel","KRAA","04330"]
["Krakeend","KRAK","01820"]
["Kramsvogel","KRAM","11980"]
["Krombekstrandloper","KRST","05090"]
["Krooneend","KROO","01960"]
["Kruisbek","KRUI","16660"]
["Kuifaalscholver","KAAL","00800"]
["Kuifduiker","KUDU","00110"]
["Kuifeend","KUFE","02030"]
["Kuifleeuwerik","KULE","09720"]
["Kuifmees","KUME","14540"]
["Kwak","KWAK","01040"]
["Kwartel","KWAR","03700"]
["Kwartelkoning","KWKO","04210"]
["Lachstern","LACH","06050"]
["Lepelaar","LEPE","01440"]
["Mandarijneend","MAND","01751"]
["Marmereend","MARM","01950"]
["Matkop","MATK","14420"]
["Meerkoet","MEKO","04290"]
["Meeuw non det","MEEU","05899"]
["Merel","MERE","11870"]
["Middelste bonte specht","MIBS","08830"]
["Middelste jager","MIDJ","05660"]
["Middelste Zaagbek","MIDZ","02210"]
["Monniksgier","MONG","02550"]
["Morinelplevier","MOPL","04820"]
["Muskuseend","MUEE","1750"]
["Nachtegaal","NACH","11040"]
["Nachtzwaluw","NAZW","07780"]
["Nijlgans","NIJG","01700"]
["Nonnetje","NON","02200"]
["Noordse boszanger","NOOB","12950"]
["Noordse nachtegaal","NOON","11030"]
["Noordse Stern","NOST","06160"]
["Notenkraker","NOTK","15570"]
["Oeverloper","OEVL","05560"]
["Oeverpieper","OEVP",10143]
["Oeverzwaluw","OEZW","09810"]
["Ooievaar","OOI","01340"]
["Ortolaan","ORTO","18660"]
["Paapje","PAAP","11370"]
["Paarse strandloper","PSTR","05100"]
["Pallas' boszanger","PALL","12980"]
["Parelduiker","PADU","00030"]
["Patrijs","PATR","03670"]
["Pestvogel","PEST","10480"]
["Pijlstaart","PIJL","01890"]
["Pimpelmees","PIME","14620"]
["Poelruiter","PORU","05470"]
["Poelsnip","POES","05200"]
["Pontische meeuw","GPOM","5927"]
["Porseleinhoen","PORS","04080"]
["Purperreiger","PURR","01240"]
["Putter","PUT","16530"]
["Raaf","RAAF","15720"]
["Ralreiger","RALR","01080"]
["Ransuil","RANU","07670"]
["Regenwulp","REGW","05380"]
["Rietgans","RIEG","01570"]
["Rietgors","RIGO",18770]
["Rietzanger","RIEZ","12430"]
["Ringmus","RIMU","15980"]
["Rode Patrijs","ROPA","03580"]
["Rode Wouw","RODW","02390"]
["Roek","ROEK","15630"]
["Roerdomp","ROER","00950"]
["Roodborst","ROBO","10990"]
["Roodborsttapuit","ROBT","11390"]
["Roodhalsfuut","ROFU","00100"]
["Roodhalsgans","ROOG","01690"]
["Roodkeelduiker","RODU","00020"]
["Roodkeelpieper","ROPI","10120"]
["Roodkopklauwier","ROKL","15230"]
["Roodmus","ROMU","16790"]
["Roodpootvalk","ROOV","03070"]
["Rosse franjepoot","ROSF","05650"]
["Rosse Grutto","ROSG","05340"]
["Rotgans","ROTG","01680"]
["Rotskruiper","ROKR","14820"]
["Rouwkwikstaart","ROUK","10202"]
["Ruigpootbuizerd","RUIB","02900"]
["Ruigpootuil","RUIU","07700"]
["Scharrelaar","SCHA","08410"]
["Scholekster","SCHO","04500"]
["Schreeuwarend","SCHR","02920"]
["Siberische taling","SIBT","01830"]
["Sijs","SIJS","16540"]
["Slangenarend","SLAA","02560"]
["Slechtvalk","SLEV","03200"]
["Slobeend","SLOB","01940"]
["Smelleken","SMEL","03090"]
["Smient","SMIE","01790"]
["Sneeuwgans","SNEG","01630"]
["Sneeuwgors","SNGO","18500"]
["Snor","SNOR","12380"]
["Soepeend","SOEP","01861"]
["Soepgans","SOGA","01721"]
["Sperwer","SPER","02690"]
["Sperwergrasmus","SGRA","12730"]
["Spotvogel","SPOT","12590"]
["Spreeuw","SPRE","15820"]
["Sprinkhaanzanger","SPRR","12360"]
["Staartmees","STAM",14374]
["Stads/Postduif","STDU","6699"]
["Steenarend","STAR","02960"]
["Steenloper","STLO","05610"]
["Steenuil","STUI","07570"]
["Steltkluut","STEL","04550"]
["Steppenarend","STEA","02942"]
["Steppenkiekendief","STKI","02620"]
["Stormmeeuw","STOM","05900"]
["Strandleeuwerik","STLE","09780"]
["Strandplevier","STRP","04770"]
["Tafeleend","TAFE","01980"]
["Taigaboomkruiper","TAIG","14860"]
["Taigarietgans","TGRG","01571"]
["Tamme gans (exoot)","TAMG","01719"]
["Tapuit","TAPU","11460"]
["Temmincks Strandloper","TEMS","05020"]
["Terek ruiter","TERU","05550"]
["Tjiftjaf","TJIF","13110"]
["Toendrarietgans","TDRG","1574"]
["Toppereend","TOP","02040"]
["Torenvalk","TOVA","03040"]
["Tortelduif","TORT","06870"]
["Tuinfluiter","TUIF","12760"]
["Tureluur","TURE","05460"]
["Turkse Tortel","TUTO","06840"]
["Vale gier","VALG","02510"]
["Veldleeuwerik","VELD","09760"]
["Velduil","VELU","07680"]
["Vink","VINK","16360"]
["Visarend","VISA","03010"]
["Visdief","VISD","06150"]
["Vuurgoudhaantje","VUGO","13150"]
["Waaierstaartrietzanger","WAAZ","12260"]
["Waterhoen","WAHO","04240"]
["Waterpieper","WATP","10141"]
["Waterral","WRAL","04070"]
["Waterrietzanger","WATZ","12420"]
["Watersnip","WATS","05190"]
["Waterspreeuw","WSPR","10500"]
["Wespendief","WESP","02310"]
["Wielewaal","WIEL","15080"]
["Wilde Eend","WILE","01860"]
["Wilde Zwaan","WIZW","01540"]
["Winterkoning","WIKO","10660"]
["Wintertaling","WINT","01840"]
["Witgatje","WITG","05530"]
["Witkopeend","WITK","02260"]
["Witoogeend","WITO","02020"]
["Witstuitbarmsijs","WBAR","16640"]
["Witte Kwikstaart","WIKW",10201]
["Witvleugelstern","WIST","06280"]
["Witwangstern","WWST","06260"]
["Woudaapje","WOUD","00980"]
["Wulp","WULP","05410"]
["Zanglijster","ZANL","12000"]
["Zeearend","ZEEA","02430"]
["Zeekoet","ZEEK","06340"]
["Zilvermeeuw","ZILM","05920"]
["Zilverplevier","ZIPL","04860"]
["Zomertaling","ZOMT","01910"]
["Zwaangans","ZWGA","01560"]
["Zwarte Ibis","ZWIB","01360"]
["Zwarte Kraai","ZWKR",15671]
["Zwarte Mees","ZWME","14610"]
["Zwarte Ooievaar","ZWOO","01310"]
["Zwarte Roodstaart","ZWRO","11210"]
["Zwarte Ruiter","ZWRU","05450"]
["Zwarte Specht","ZWSP","08630"]
["Zwarte Stern","ZWST","06270"]
["Zwarte Wouw","ZWAW","02380"]
["Zwarte Zeeëend","ZWZE","02130"]
["Zwarte Zwaan","ZWZW","01545"]
["Zwartkop","ZWKO","12770"]
["Zwartkopmeeuw","ZWKM","05750"]
["Zwemeend spec","ZWEM","01898"]

{"sheet":"ExportBezoek","index":4,"n_rows":2,"n_cols":19,"rows_kept":2,"cut":false,"hidden":true,"merged":[]}
["code","gebied","waarnemer","datum","begintijd","eindtijd","windrichting","windkracht","temperatuur","neerslag","zicht","kijker","methode","objecten","bewolking","waterstand","sneeuw","ijs","notitie"]
[{"$f":"Invoer!A$4&Invoer!B$4&TEXT(Invoer!C$4,\"dd-mm-jjjj\")&TEXT(Invoer!D$4,\"uu:mm\")","v":"00-01-190000:00"},{"$f":"Invoer!A4","v":0},{"$f":"Invoer!B4","v":0},{"$f":"Invoer!C4","v":"00:00:00"},{"$f":"IF(ISBLANK(Invoer!D4),,Invoer!D4)","v":"00:00:00"},{"$f":"IF(ISBLANK(Invoer!E4),,Invoer!E4)","v":"00:00:00"},{"$f":"IF(ISBLANK(Invoer!F4),\"-\",Invoer!F4)","v":"-"},{"$f":"IF(ISBLANK(Invoer!G4),\"-\",Invoer!G4)","v":"-"},{"$f":"IF(ISBLANK(Invoer!H4),\"-\",Invoer!H4)","v":"-"},{"$f":"IF(ISBLANK(Invoer!A7),\"-\",Invoer!A7)","v":"-"},{"$f":"IF(ISBLANK(Invoer!B7),\"-\",Invoer!B7)","v":"-"},{"$f":"IF(ISBLANK(Invoer!C7),\"-\",Invoer!C7)","v":"-"},{"$f":"IF(ISBLANK(Invoer!D7),\"0\",VLOOKUP(Invoer!D7,Lijsten!F8:G9,2,FALSE))","v":"0"},{"$f":"IF(ISBLANK(Invoer!F7),\"0\",VLOOKUP(Invoer!F7,Lijsten!F1:G4,2,FALSE))","v":"0"},{"$f":"IF(ISBLANK(Invoer!A10),\"-\",Invoer!A10)","v":"-"},{"$f":"IF(ISBLANK(Invoer!B10),\"-\",Invoer!B10)","v":"-"},{"$f":"IF(ISBLANK(Invoer!C10),\"-\",Invoer!C10)","v":"-"},{"$f":"IF(ISBLANK(Invoer!D10),\"-\",Invoer!D10)","v":"-"},{"$f":"IF(ISBLANK(Invoer!E10),\"-\",Invoer!E10)","v":"-"}]

{"sheet":"ExportWaarneming","index":5,"n_rows":135,"n_cols":7,"rows_kept":135,"cut":false,"hidden":true,"merged":[]}
["Code","soort","totaal","man","vrouw","onvolwassen","notitie"]
[{"$f":"Invoer!A$4&Invoer!B$4&TEXT(Invoer!C$4,\"dd-mm-jjjj\")&TEXT(Invoer!D$4,\"uu:mm\")","v":"00-01-190000:00"},{"$f":"IF(NOT(Invoer!B13=\"\"),Invoer!B13)","v":"00000"},{"$f":"IF(NOT(Invoer!D13=\"\"),Invoer!D13,)","v":0},{"$f":"IF(NOT(Invoer!E13=\"\"),Invoer!E13,)","v":0},{"$f":"IF(NOT(Invoer!F13=\"\"),Invoer!F13,)","v":0},{"$f":"IF(NOT(Invoer!G13=\"\"),Invoer!G13,)","v":0},{"$f":"IF(Invoer!H13=\"\",\"-\",Invoer!H13)","v":"-"}]
[{"$f":"Invoer!A$4&Invoer!B$4&TEXT(Invoer!C$4,\"dd-mm-jjjj\")&TEXT(Invoer!D$4,\"uu:mm\")","v":"00-01-190000:00"},{"$f":"IF(NOT(Invoer!B14=\"\"),Invoer!B14)","v":"00070"},{"$f":"IF(NOT(Invoer!D14=\"\"),Invoer!D14,)","v":0},{"$f":"IF(NOT(Invoer!E14=\"\"),Invoer!E14,)","v":0},{"$f":"IF(NOT(Invoer!F14=\"\"),Invoer!F14,)","v":0},{"$f":"IF(NOT(Invoer!G14=\"\"),Invoer!G14,)","v":0},{"$f":"IF(Invoer!H14=\"\",\"-\",Invoer!H14)","v":"-"}]
[{"$f":"Invoer!A$4&Invoer!B$4&TEXT(Invoer!C$4,\"dd-mm-jjjj\")&TEXT(Invoer!D$4,\"uu:mm\")","v":"00-01-190000:00"},{"$f":"IF(NOT(Invoer!B15=\"\"),Invoer!B15)","v":"00090"},{"$f":"IF(NOT(Invoer!D15=\"\"),Invoer!D15,)","v":0},{"$f":"IF(NOT(Invoer!E15=\"\"),Invoer!E15,)","v":0},{"$f":"IF(NOT(Invoer!F15=\"\"),Invoer!F15,)","v":0},{"$f":"IF(NOT(Invoer!G15=\"\"),Invoer!G15,)","v":0},{"$f":"IF(Invoer!H15=\"\",\"-\",Invoer!H15)","v":"-"}]
[{"$f":"Invoer!A$4&Invoer!B$4&TEXT(Invoer!C$4,\"dd-mm-jjjj\")&TEXT(Invoer!D$4,\"uu:mm\")","v":"00-01-190000:00"},{"$f":"IF(NOT(Invoer!B16=\"\"),Invoer!B16)","v":"00720"},{"$f":"IF(NOT(Invoer!D16=\"\"),Invoer!D16,)","v":0},{"$f":"IF(NOT(Invoer!E16=\"\"),Invoer!E16,)","v":0},{"$f":"IF(NOT(Invoer!F16=\"\"),Invoer!F16,)","v":0},{"$f":"IF(NOT(Invoer!G16=\"\"),Invoer!G16,)","v":0},{"$f":"IF(Invoer!H16=\"\",\"-\",Invoer!H16)","v":"-"}]
[{"$f":"Invoer!A$4&Invoer!B$4&TEXT(Invoer!C$4,\"dd-mm-jjjj\")&TEXT(Invoer!D$4,\"uu:mm\")","v":"00-01-190000:00"},{"$f":"IF(NOT(Invoer!B17=\"\"),Invoer!B17)","v":"00950"},{"$f":"IF(NOT(Invoer!D17=\"\"),Invoer!D17,)","v":0},{"$f":"IF(NOT(Invoer!E17=\"\"),Invoer!E17,)","v":0},{"$f":"IF(NOT(Invoer!F17=\"\"),Invoer!F17,)","v":0},{"$f":"IF(NOT(Invoer!G17=\"\"),Invoer!G17,)","v":0},{"$f":"IF(Invoer!H17=\"\",\"-\",Invoer!H17)","v":"-"}]
[{"$f":"Invoer!A$4&Invoer!B$4&TEXT(Invoer!C$4,\"dd-mm-jjjj\")&TEXT(Invoer!D$4,\"uu:mm\")","v":"00-01-190000:00"},{"$f":"IF(NOT(Invoer!B18=\"\"),Invoer!B18)","v":"01210"},{"$f":"IF(NOT(Invoer!D18=\"\"),Invoer!D18,)","v":0},{"$f":"IF(NOT(Invoer!E18=\"\"),Invoer!E18,)","v":0},{"$f":"IF(NOT(Invoer!F18=\"\"),Invoer!F18,)","v":0},{"$f":"IF(NOT(Invoer!G18=\"\"),Invoer!G18,)","v":0},{"$f":"IF(Invoer!H18=\"\",\"-\",Invoer!H18)","v":"-"}]
[{"$f":"Invoer!A$4&Invoer!B$4&TEXT(Invoer!C$4,\"dd-mm-jjjj\")&TEXT(Invoer!D$4,\"uu:mm\")","v":"00-01-190000:00"},{"$f":"IF(NOT(Invoer!B19=\"\"),Invoer!B19)","v":"01220"},{"$f":"IF(NOT(Invoer!D19=\"\"),Invoer!D19,)","v":0},{"$f":"IF(NOT(Invoer!E19=\"\"),Invoer!E19,)","v":0},{"$f":"IF(NOT(Invoer!F19=\"\"),Invoer!F19,)","v":0},{"$f":"IF(NOT(Invoer!G19=\"\"),Invoer!G19,)","v":0},{"$f":"IF(Invoer!H19=\"\",\"-\",Invoer!H19)","v":"-"}]
[{"$f":"Invoer!A$4&Invoer!B$4&TEXT(Invoer!C$4,\"dd-mm-jjjj\")&TEXT(Invoer!D$4,\"uu:mm\")","v":"00-01-190000:00"},{"$f":"IF(NOT(Invoer!B20=\"\"),Invoer!B20)","v":"01440"},{"$f":"IF(NOT(Invoer!D20=\"\"),Invoer!D20,)","v":0},{"$f":"IF(NOT(Invoer!E20=\"\"),Invoer!E20,)","v":0},{"$f":"IF(NOT(Invoer!F20=\"\"),Invoer!F20,)","v":0},{"$f":"IF(NOT(Invoer!G20=\"\"),Invoer!G20,)","v":0},{"$f":"IF(Invoer!H20=\"\",\"-\",Invoer!H20)","v":"-"}]
[{"$f":"Invoer!A$4&Invoer!B$4&TEXT(Invoer!C$4,\"dd-mm-jjjj\")&TEXT(Invoer!D$4,\"uu:mm\")","v":"00-01-190000:00"},{"$f":"IF(NOT(Invoer!B21=\"\"),Invoer!B21)","v":"01520"},{"$f":"IF(NOT(Invoer!D21=\"\"),Invoer!D21,)","v":0},{"$f":"IF(NOT(Invoer!E21=\"\"),Invoer!E21,)","v":0},{"$f":"IF(NOT(Invoer!F21=\"\"),Invoer!F21,)","v":0},{"$f":"IF(NOT(Invoer!G21=\"\"),Invoer!G21,)","v":0},{"$f":"IF(Invoer!H21=\"\",\"-\",Invoer!H21)","v":"-"}]
[{"$f":"Invoer!A$4&Invoer!B$4&TEXT(Invoer!C$4,\"dd-mm-jjjj\")&TEXT(Invoer!D$4,\"uu:mm\")","v":"00-01-190000:00"},{"$f":"IF(NOT(Invoer!B22=\"\"),Invoer!B22)","v":"01590"},{"$f":"IF(NOT(Invoer!D22=\"\"),Invoer!D22,)","v":0},{"$f":"IF(NOT(Invoer!E22=\"\"),Invoer!E22,)","v":0},{"$f":"IF(NOT(Invoer!F22=\"\"),Invoer!F22,)","v":0},{"$f":"IF(NOT(Invoer!G22=\"\"),Invoer!G22,)","v":0},{"$f":"IF(Invoer!H22=\"\",\"-\",Invoer!H22)","v":"-"}]
[{"$f":"Invoer!A$4&Invoer!B$4&TEXT(Invoer!C$4,\"dd-mm-jjjj\")&TEXT(Invoer!D$4,\"uu:mm\")","v":"00-01-190000:00"},{"$f":"IF(NOT(Invoer!B23=\"\"),Invoer!B23)","v":"01610"},{"$f":"IF(NOT(Invoer!D23=\"\"),Invoer!D23,)","v":0},{"$f":"IF(NOT(Invoer!E23=\"\"),Invoer!E23,)","v":0},{"$f":"IF(NOT(Invoer!F23=\"\"),Invoer!F23,)","v":0},{"$f":"IF(NOT(Invoer!G23=\"\"),Invoer!G23,)","v":0},{"$f":"IF(Invoer!H23=\"\",\"-\",Invoer!H23)","v":"-"}]
[{"$f":"Invoer!A$4&Invoer!B$4&TEXT(Invoer!C$4,\"dd-mm-jjjj\")&TEXT(Invoer!D$4,\"uu:mm\")","v":"00-01-190000:00"},{"$f":"IF(NOT(Invoer!B24=\"\"),Invoer!B24)","v":"01668"},{"$f":"IF(NOT(Invoer!D24=\"\"),Invoer!D24,)","v":0},{"$f":"IF(NOT(Invoer!E24=\"\"),Invoer!E24,)","v":0},{"$f":"IF(NOT(Invoer!F24=\"\"),Invoer!F24,)","v":0},{"$f":"IF(NOT(Invoer!G24=\"\"),Invoer!G24,)","v":0},{"$f":"IF(Invoer!H24=\"\",\"-\",Invoer!H24)","v":"-"}]
[{"$f":"Invoer!A$4&Invoer!B$4&TEXT(Invoer!C$4,\"dd-mm-jjjj\")&TEXT(Invoer!D$4,\"uu:mm\")","v":"00-01-190000:00"},{"$f":"IF(NOT(Invoer!B25=\"\"),Invoer!B25)","v":"01670"},{"$f":"IF(NOT(Invoer!D25=\"\"),Invoer!D25,)","v":0},{"$f":"IF(NOT(Invoer!E25=\"\"),Invoer!E25,)","v":0},{"$f":"IF(NOT(Invoer!F25=\"\"),Invoer!F25,)","v":0},{"$f":"IF(NOT(Invoer!G25=\"\"),Invoer!G25,)","v":0},{"$f":"IF(Invoer!H25=\"\",\"-\",Invoer!H25)","v":"-"}]
[{"$f":"Invoer!A$4&Invoer!B$4&TEXT(Invoer!C$4,\"dd-mm-jjjj\")&TEXT(Invoer!D$4,\"uu:mm\")","v":"00-01-190000:00"},{"$f":"IF(NOT(Invoer!B26=\"\"),Invoer!B26)","v":"01700"},{"$f":"IF(NOT(Invoer!D26=\"\"),Invoer!D26,)","v":0},{"$f":"IF(NOT(Invoer!E26=\"\"),Invoer!E26,)","v":0},{"$f":"IF(NOT(Invoer!F26=\"\"),Invoer!F26,)","v":0},{"$f":"IF(NOT(Invoer!G26=\"\"),Invoer!G26,)","v":0},{"$f":"IF(Invoer!H26=\"\",\"-\",Invoer!H26)","v":"-"}]
[{"$f":"Invoer!A$4&Invoer!B$4&TEXT(Invoer!C$4,\"dd-mm-jjjj\")&TEXT(Invoer!D$4,\"uu:mm\")","v":"00-01-190000:00"},{"$f":"IF(NOT(Invoer!B27=\"\"),Invoer!B27)","v":"01721"},{"$f":"IF(NOT(Invoer!D27=\"\"),Invoer!D27,)","v":0},{"$f":"IF(NOT(Invoer!E27=\"\"),Invoer!E27,)","v":0},{"$f":"IF(NOT(Invoer!F27=\"\"),Invoer!F27,)","v":0},{"$f":"IF(NOT(Invoer!G27=\"\"),Invoer!G27,)","v":0},{"$f":"IF(Invoer!H27=\"\",\"-\",Invoer!H27)","v":"-"}]
[{"$f":"Invoer!A$4&Invoer!B$4&TEXT(Invoer!C$4,\"dd-mm-jjjj\")&TEXT(Invoer!D$4,\"uu:mm\")","v":"00-01-190000:00"},{"$f":"IF(NOT(Invoer!B28=\"\"),Invoer!B28)","v":"01730"},{"$f":"IF(NOT(Invoer!D28=\"\"),Invoer!D28,)","v":0},{"$f":"IF(NOT(Invoer!E28=\"\"),Invoer!E28,)","v":0},{"$f":"IF(NOT(Invoer!F28=\"\"),Invoer!F28,)","v":0},{"$f":"IF(NOT(Invoer!G28=\"\"),Invoer!G28,)","v":0},{"$f":"IF(Invoer!H28=\"\",\"-\",Invoer!H28)","v":"-"}]
[{"$f":"Invoer!A$4&Invoer!B$4&TEXT(Invoer!C$4,\"dd-mm-jjjj\")&TEXT(Invoer!D$4,\"uu:mm\")","v":"00-01-190000:00"},{"$f":"IF(NOT(Invoer!B29=\"\"),Invoer!B29)","v":"01790"},{"$f":"IF(NOT(Invoer!D29=\"\"),Invoer!D29,)","v":0},{"$f":"IF(NOT(Invoer!E29=\"\"),Invoer!E29,)","v":0},{"$f":"IF(NOT(Invoer!F29=\"\"),Invoer!F29,)","v":0},{"$f":"IF(NOT(Invoer!G29=\"\"),Invoer!G29,)","v":0},{"$f":"IF(Invoer!H29=\"\",\"-\",Invoer!H29)","v":"-"}]
[{"$f":"Invoer!A$4&Invoer!B$4&TEXT(Invoer!C$4,\"dd-mm-jjjj\")&TEXT(Invoer!D$4,\"uu:mm\")","v":"00-01-190000:00"},{"$f":"IF(NOT(Invoer!B30=\"\"),Invoer!B30)","v":"01820"},{"$f":"IF(NOT(Invoer!D30=\"\"),Invoer!D30,)","v":0},{"$f":"IF(NOT(Invoer!E30=\"\"),Invoer!E30,)","v":0},{"$f":"IF(NOT(Invoer!F30=\"\"),Invoer!F30,)","v":0},{"$f":"IF(NOT(Invoer!G30=\"\"),Invoer!G30,)","v":0},{"$f":"IF(Invoer!H30=\"\",\"-\",Invoer!H30)","v":"-"}]
[{"$f":"Invoer!A$4&Invoer!B$4&TEXT(Invoer!C$4,\"dd-mm-jjjj\")&TEXT(Invoer!D$4,\"uu:mm\")","v":"00-01-190000:00"},{"$f":"IF(NOT(Invoer!B31=\"\"),Invoer!B31)","v":"01840"},{"$f":"IF(NOT(Invoer!D31=\"\"),Invoer!D31,)","v":0},{"$f":"IF(NOT(Invoer!E31=\"\"),Invoer!E31,)","v":0},{"$f":"IF(NOT(Invoer!F31=\"\"),Invoer!F31,)","v":0},{"$f":"IF(NOT(Invoer!G31=\"\"),Invoer!G31,)","v":0},{"$f":"IF(Invoer!H31=\"\",\"-\",Invoer!H31)","v":"-"}]
[{"$f":"Invoer!A$4&Invoer!B$4&TEXT(Invoer!C$4,\"dd-mm-jjjj\")&TEXT(Invoer!D$4,\"uu:mm\")","v":"00-01-190000:00"},{"$f":"IF(NOT(Invoer!B32=\"\"),Invoer!B32)","v":"01860"},{"$f":"IF(NOT(Invoer!D32=\"\"),Invoer!D32,)","v":0},{"$f":"IF(NOT(Invoer!E32=\"\"),Invoer!E32,)","v":0},{"$f":"IF(NOT(Invoer!F32=\"\"),Invoer!F32,)","v":0},{"$f":"IF(NOT(Invoer!G32=\"\"),Invoer!G32,)","v":0},{"$f":"IF(Invoer!H32=\"\",\"-\",Invoer!H32)","v":"-"}]
[{"$f":"Invoer!A$4&Invoer!B$4&TEXT(Invoer!C$4,\"dd-mm-jjjj\")&TEXT(Invoer!D$4,\"uu:mm\")","v":"00-01-190000:00"},{"$f":"IF(NOT(Invoer!B33=\"\"),Invoer!B33)","v":"01861"},{"$f":"IF(NOT(Invoer!D33=\"\"),Invoer!D33,)","v":0},{"$f":"IF(NOT(Invoer!E33=\"\"),Invoer!E33,)","v":0},{"$f":"IF(NOT(Invoer!F33=\"\"),Invoer!F33,)","v":0},{"$f":"IF(NOT(Invoer!G33=\"\"),Invoer!G33,)","v":0},{"$f":"IF(Invoer!H33=\"\",\"-\",Invoer!H33)","v":"-"}]
[{"$f":"Invoer!A$4&Invoer!B$4&TEXT(Invoer!C$4,\"dd-mm-jjjj\")&TEXT(Invoer!D$4,\"uu:mm\")","v":"00-01-190000:00"},{"$f":"IF(NOT(Invoer!B34=\"\"),Invoer!B34)","v":"01890"},{"$f":"IF(NOT(Invoer!D34=\"\"),Invoer!D34,)","v":0},{"$f":"IF(NOT(Invoer!E34=\"\"),Invoer!E34,)","v":0},{"$f":"IF(NOT(Invoer!F34=\"\"),Invoer!F34,)","v":0},{"$f":"IF(NOT(Invoer!G34=\"\"),Invoer!G34,)","v":0},{"$f":"IF(Invoer!H34=\"\",\"-\",Invoer!H34)","v":"-"}]
[{"$f":"Invoer!A$4&Invoer!B$4&TEXT(Invoer!C$4,\"dd-mm-jjjj\")&TEXT(Invoer!D$4,\"uu:mm\")","v":"00-01-190000:00"},{"$f":"IF(NOT(Invoer!B35=\"\"),Invoer!B35)","v":"01940"},{"$f":"IF(NOT(Invoer!D35=\"\"),Invoer!D35,)","v":0},{"$f":"IF(NOT(Invoer!E35=\"\"),Invoer!E35,)","v":0},{"$f":"IF(NOT(Invoer!F35=\"\"),Invoer!F35,)","v":0},{"$f":"IF(NOT(Invoer!G35=\"\"),Invoer!G35,)","v":0},{"$f":"IF(Invoer!H35=\"\",\"-\",Invoer!H35)","v":"-"}]
[{"$f":"Invoer!A$4&Invoer!B$4&TEXT(Invoer!C$4,\"dd-mm-jjjj\")&TEXT(Invoer!D$4,\"uu:mm\")","v":"00-01-190000:00"},{"$f":"IF(NOT(Invoer!B36=\"\"),Invoer!B36)","v":"01980"},{"$f":"IF(NOT(Invoer!D36=\"\"),Invoer!D36,)","v":0},{"$f":"IF(NOT(Invoer!E36=\"\"),Invoer!E36,)","v":0},{"$f":"IF(NOT(Invoer!F36=\"\"),Invoer!F36,)","v":0},{"$f":"IF(NOT(Invoer!G36=\"\"),Invoer!G36,)","v":0},{"$f":"IF(Invoer!H36=\"\",\"-\",Invoer!H36)","v":"-"}]
[{"$f":"Invoer!A$4&Invoer!B$4&TEXT(Invoer!C$4,\"dd-mm-jjjj\")&TEXT(Invoer!D$4,\"uu:mm\")","v":"00-01-190000:00"},{"$f":"IF(NOT(Invoer!B37=\"\"),Invoer!B37)","v":"02030"},{"$f":"IF(NOT(Invoer!D37=\"\"),Invoer!D37,)","v":0},{"$f":"IF(NOT(Invoer!E37=\"\"),Invoer!E37,)","v":0},{"$f":"IF(NOT(Invoer!F37=\"\"),Invoer!F37,)","v":0},{"$f":"IF(NOT(Invoer!G37=\"\"),Invoer!G37,)","v":0},{"$f":"IF(Invoer!H37=\"\",\"-\",Invoer!H37)","v":"-"}]
[{"$f":"Invoer!A$4&Invoer!B$4&TEXT(Invoer!C$4,\"dd-mm-jjjj\")&TEXT(Invoer!D$4,\"uu:mm\")","v":"00-01-190000:00"},{"$f":"IF(NOT(Invoer!B38=\"\"),Invoer!B38)","v":"02180"},{"$f":"IF(NOT(Invoer!D38=\"\"),Invoer!D38,)","v":0},{"$f":"IF(NOT(Invoer!E38=\"\"),Invoer!E38,)","v":0},{"$f":"IF(NOT(Invoer!F38=\"\"),Invoer!F38,)","v":0},{"$f":"IF(NOT(Invoer!G38=\"\"),Invoer!G38,)","v":0},{"$f":"IF(Invoer!H38=\"\",\"-\",Invoer!H38)","v":"-"}]
[{"$f":"Invoer!A$4&Invoer!B$4&TEXT(Invoer!C$4,\"dd-mm-jjjj\")&TEXT(Invoer!D$4,\"uu:mm\")","v":"00-01-190000:00"},{"$f":"IF(NOT(Invoer!B39=\"\"),Invoer!B39)","v":"02200"},{"$f":"IF(NOT(Invoer!D39=\"\"),Invoer!D39,)","v":0},{"$f":"IF(NOT(Invoer!E39=\"\"),Invoer!E39,)","v":0},{"$f":"IF(NOT(Invoer!F39=\"\"),Invoer!F39,)","v":0},{"$f":"IF(NOT(Invoer!G39=\"\"),Invoer!G39,)","v":0},{"$f":"IF(Invoer!H39=\"\",\"-\",Invoer!H39)","v":"-"}]
[{"$f":"Invoer!A$4&Invoer!B$4&TEXT(Invoer!C$4,\"dd-mm-jjjj\")&TEXT(Invoer!D$4,\"uu:mm\")","v":"00-01-190000:00"},{"$f":"IF(NOT(Invoer!B40=\"\"),Invoer!B40)","v":"02230"},{"$f":"IF(NOT(Invoer!D40=\"\"),Invoer!D40,)","v":0},{"$f":"IF(NOT(Invoer!E40=\"\"),Invoer!E40,)","v":0},{"$f":"IF(NOT(Invoer!F40=\"\"),Invoer!F40,)","v":0},{"$f":"IF(NOT(Invoer!G40=\"\"),Invoer!G40,)","v":0},{"$f":"IF(Invoer!H40=\"\",\"-\",Invoer!H40)","v":"-"}]
[{"$f":"Invoer!A$4&Invoer!B$4&TEXT(Invoer!C$4,\"dd-mm-jjjj\")&TEXT(Invoer!D$4,\"uu:mm\")","v":"00-01-190000:00"},{"$f":"IF(NOT(Invoer!B41=\"\"),Invoer!B41)","v":"02600"},{"$f":"IF(NOT(Invoer!D41=\"\"),Invoer!D41,)","v":0},{"$f":"IF(NOT(Invoer!E41=\"\"),Invoer!E41,)","v":0},{"$f":"IF(NOT(Invoer!F41=\"\"),Invoer!F41,)","v":0},{"$f":"IF(NOT(Invoer!G41=\"\"),Invoer!G41,)","v":0},{"$f":"IF(Invoer!H41=\"\",\"-\",Invoer!H41)","v":"-"}]
[{"$f":"Invoer!A$4&Invoer!B$4&TEXT(Invoer!C$4,\"dd-mm-jjjj\")&TEXT(Invoer!D$4,\"uu:mm\")","v":"00-01-190000:00"},{"$f":"IF(NOT(Invoer!B42=\"\"),Invoer!B42)","v":"02610"},{"$f":"IF(NOT(Invoer!D42=\"\"),Invoer!D42,)","v":0},{"$f":"IF(NOT(Invoer!E42=\"\"),Invoer!E42,)","v":0},{"$f":"IF(NOT(Invoer!F42=\"\"),Invoer!F42,)","v":0},{"$f":"IF(NOT(Invoer!G42=\"\"),Invoer!G42,)","v":0},{"$f":"IF(Invoer!H42=\"\",\"-\",Invoer!H42)","v":"-"}]
[{"$f":"Invoer!A$4&Invoer!B$4&TEXT(Invoer!C$4,\"dd-mm-jjjj\")&TEXT(Invoer!D$4,\"uu:mm\")","v":"00-01-190000:00"},{"$f":"IF(NOT(Invoer!B43=\"\"),Invoer!B43)","v":"02670"},{"$f":"IF(NOT(Invoer!D43=\"\"),Invoer!D43,)","v":0},{"$f":"IF(NOT(Invoer!E43=\"\"),Invoer!E43,)","v":0},{"$f":"IF(NOT(Invoer!F43=\"\"),Invoer!F43,)","v":0},{"$f":"IF(NOT(Invoer!G43=\"\"),Invoer!G43,)","v":0},{"$f":"IF(Invoer!H43=\"\",\"-\",Invoer!H43)","v":"-"}]
[{"$f":"Invoer!A$4&Invoer!B$4&TEXT(Invoer!C$4,\"dd-mm-jjjj\")&TEXT(Invoer!D$4,\"uu:mm\")","v":"00-01-190000:00"},{"$f":"IF(NOT(Invoer!B44=\"\"),Invoer!B44)","v":"02690"},{"$f":"IF(NOT(Invoer!D44=\"\"),Invoer!D44,)","v":0},{"$f":"IF(NOT(Invoer!E44=\"\"),Invoer!E44,)","v":0},{"$f":"IF(NOT(Invoer!F44=\"\"),Invoer!F44,)","v":0},{"$f":"IF(NOT(Invoer!G44=\"\"),Invoer!G44,)","v":0},{"$f":"IF(Invoer!H44=\"\",\"-\",Invoer!H44)","v":"-"}]
[{"$f":"Invoer!A$4&Invoer!B$4&TEXT(Invoer!C$4,\"dd-mm-jjjj\")&TEXT(Invoer!D$4,\"uu:mm\")","v":"00-01-190000:00"},{"$f":"IF(NOT(Invoer!B45=\"\"),Invoer!B45)","v":"02870"},{"$f":"IF(NOT(Invoer!D45=\"\"),Invoer!D45,)","v":0},{"$f":"IF(NOT(Invoer!E45=\"\"),Invoer!E45,)","v":0},{"$f":"IF(NOT(Invoer!F45=\"\"),Invoer!F45,)","v":0},{"$f":"IF(NOT(Invoer!G45=\"\"),Invoer!G45,)","v":0},{"$f":"IF(Invoer!H45=\"\",\"-\",Invoer!H45)","v":"-"}]
[{"$f":"Invoer!A$4&Invoer!B$4&TEXT(Invoer!C$4,\"dd-mm-jjjj\")&TEXT(Invoer!D$4,\"uu:mm\")","v":"00-01-190000:00"},{"$f":"IF(NOT(Invoer!B46=\"\"),Invoer!B46)","v":"03040"},{"$f":"IF(NOT(Invoer!D46=\"\"),Invoer!D46,)","v":0},{"$f":"IF(NOT(Invoer!E46=\"\"),Invoer!E46,)","v":0},{"$f":"IF(NOT(Invoer!F46=\"\"),Invoer!F46,)","v":0},{"$f":"IF(NOT(Invoer!G46=\"\"),Invoer!G46,)","v":0},{"$f":"IF(Invoer!H46=\"\",\"-\",Invoer!H46)","v":"-"}]
[{"$f":"Invoer!A$4&Invoer!B$4&TEXT(Invoer!C$4,\"dd-mm-jjjj\")&TEXT(Invoer!D$4,\"uu:mm\")","v":"00-01-190000:00"},{"$f":"IF(NOT(Invoer!B47=\"\"),Invoer!B47)","v":"03100"},{"$f":"IF(NOT(Invoer!D47=\"\"),Invoer!D47,)","v":0},{"$f":"IF(NOT(Invoer!E47=\"\"),Invoer!E47,)","v":0},{"$f":"IF(NOT(Invoer!F47=\"\"),Invoer!F47,)","v":0},{"$f":"IF(NOT(Invoer!G47=\"\"),Invoer!G47,)","v":0},{"$f":"IF(Invoer!H47=\"\",\"-\",Invoer!H47)","v":"-"}]
[{"$f":"Invoer!A$4&Invoer!B$4&TEXT(Invoer!C$4,\"dd-mm-jjjj\")&TEXT(Invoer!D$4,\"uu:mm\")","v":"00-01-190000:00"},{"$f":"IF(NOT(Invoer!B48=\"\"),Invoer!B48)","v":"03200"},{"$f":"IF(NOT(Invoer!D48=\"\"),Invoer!D48,)","v":0},{"$f":"IF(NOT(Invoer!E48=\"\"),Invoer!E48,)","v":0},{"$f":"IF(NOT(Invoer!F48=\"\"),Invoer!F48,)","v":0},{"$f":"IF(NOT(Invoer!G48=\"\"),Invoer!G48,)","v":0},{"$f":"IF(Invoer!H48=\"\",\"-\",Invoer!H48)","v":"-"}]
[{"$f":"Invoer!A$4&Invoer!B$4&TEXT(Invoer!C$4,\"dd-mm-jjjj\")&TEXT(Invoer!D$4,\"uu:mm\")","v":"00-01-190000:00"},{"$f":"IF(NOT(Invoer!B49=\"\"),Invoer!B49)","v":"03940"},{"$f":"IF(NOT(Invoer!D49=\"\"),Invoer!D49,)","v":0},{"$f":"IF(NOT(Invoer!E49=\"\"),Invoer!E49,)","v":0},{"$f":"IF(NOT(Invoer!F49=\"\"),Invoer!F49,)","v":0},{"$f":"IF(NOT(Invoer!G49=\"\"),Invoer!G49,)","v":0},{"$f":"IF(Invoer!H49=\"\",\"-\",Invoer!H49)","v":"-"}]
[{"$f":"Invoer!A$4&Invoer!B$4&TEXT(Invoer!C$4,\"dd-mm-jjjj\")&TEXT(Invoer!D$4,\"uu:mm\")","v":"00-01-190000:00"},{"$f":"IF(NOT(Invoer!B50=\"\"),Invoer!B50)","v":"04070"},{"$f":"IF(NOT(Invoer!D50=\"\"),Invoer!D50,)","v":0},{"$f":"IF(NOT(Invoer!E50=\"\"),Invoer!E50,)","v":0},{"$f":"IF(NOT(Invoer!F50=\"\"),Invoer!F50,)","v":0},{"$f":"IF(NOT(Invoer!G50=\"\"),Invoer!G50,)","v":0},{"$f":"IF(Invoer!H50=\"\",\"-\",Invoer!H50)","v":"-"}]
[{"$f":"Invoer!A$4&Invoer!B$4&TEXT(Invoer!C$4,\"dd-mm-jjjj\")&TEXT(Invoer!D$4,\"uu:mm\")","v":"00-01-190000:00"},{"$f":"IF(NOT(Invoer!B51=\"\"),Invoer!B51)","v":"04240"},{"$f":"IF(NOT(Invoer!D51=\"\"),Invoer!D51,)","v":0},{"$f":"IF(NOT(Invoer!E51=\"\"),Invoer!E51,)","v":0},{"$f":"IF(NOT(Invoer!F51=\"\"),Invoer!F51,)","v":0},{"$f":"IF(NOT(Invoer!G51=\"\"),Invoer!G51,)","v":0},{"$f":"IF(Invoer!H51=\"\",\"-\",Invoer!H51)","v":"-"}]
[{"$f":"Invoer!A$4&Invoer!B$4&TEXT(Invoer!C$4,\"dd-mm-jjjj\")&TEXT(Invoer!D$4,\"uu:mm\")","v":"00-01-190000:00"},{"$f":"IF(NOT(Invoer!B52=\"\"),Invoer!B52)","v":"04290"},{"$f":"IF(NOT(Invoer!D52=\"\"),Invoer!D52,)","v":0},{"$f":"IF(NOT(Invoer!E52=\"\"),Invoer!E52,)","v":0},{"$f":"IF(NOT(Invoer!F52=\"\"),Invoer!F52,)","v":0},{"$f":"IF(NOT(Invoer!G52=\"\"),Invoer!G52,)","v":0},{"$f":"IF(Invoer!H52=\"\",\"-\",Invoer!H52)","v":"-"}]
[{"$f":"Invoer!A$4&Invoer!B$4&TEXT(Invoer!C$4,\"dd-mm-jjjj\")&TEXT(Invoer!D$4,\"uu:mm\")","v":"00-01-190000:00"},{"$f":"IF(NOT(Invoer!B53=\"\"),Invoer!B53)","v":"04500"},{"$f":"IF(NOT(Invoer!D53=\"\"),Invoer!D53,)","v":0},{"$f":"IF(NOT(Invoer!E53=\"\"),Invoer!E53,)","v":0},{"$f":"IF(NOT(Invoer!F53=\"\"),Invoer!F53,)","v":0},{"$f":"IF(NOT(Invoer!G53=\"\"),Invoer!G53,)","v":0},{"$f":"IF(Invoer!H53=\"\",\"-\",Invoer!H53)","v":"-"}]
[{"$f":"Invoer!A$4&Invoer!B$4&TEXT(Invoer!C$4,\"dd-mm-jjjj\")&TEXT(Invoer!D$4,\"uu:mm\")","v":"00-01-190000:00"},{"$f":"IF(NOT(Invoer!B54=\"\"),Invoer!B54)","v":"04850"},{"$f":"IF(NOT(Invoer!D54=\"\"),Invoer!D54,)","v":0},{"$f":"IF(NOT(Invoer!E54=\"\"),Invoer!E54,)","v":0},{"$f":"IF(NOT(Invoer!F54=\"\"),Invoer!F54,)","v":0},{"$f":"IF(NOT(Invoer!G54=\"\"),Invoer!G54,)","v":0},{"$f":"IF(Invoer!H54=\"\",\"-\",Invoer!H54)","v":"-"}]
[{"$f":"Invoer!A$4&Invoer!B$4&TEXT(Invoer!C$4,\"dd-mm-jjjj\")&TEXT(Invoer!D$4,\"uu:mm\")","v":"00-01-190000:00"},{"$f":"IF(NOT(Invoer!B55=\"\"),Invoer!B55)","v":"04930"},{"$f":"IF(NOT(Invoer!D55=\"\"),Invoer!D55,)","v":0},{"$f":"IF(NOT(Invoer!E55=\"\"),Invoer!E55,)","v":0},{"$f":"IF(NOT(Invoer!F55=\"\"),Invoer!F55,)","v":0},{"$f":"IF(NOT(Invoer!G55=\"\"),Invoer!G55,)","v":0},{"$f":"IF(Invoer!H55=\"\",\"-\",Invoer!H55)","v":"-"}]
[{"$f":"Invoer!A$4&Invoer!B$4&TEXT(Invoer!C$4,\"dd-mm-jjjj\")&TEXT(Invoer!D$4,\"uu:mm\")","v":"00-01-190000:00"},{"$f":"IF(NOT(Invoer!B56=\"\"),Invoer!B56)","v":"05170"},{"$f":"IF(NOT(Invoer!D56=\"\"),Invoer!D56,)","v":0},{"$f":"IF(NOT(Invoer!E56=\"\"),Invoer!E56,)","v":0},{"$f":"IF(NOT(Invoer!F56=\"\"),Invoer!F56,)","v":0},{"$f":"IF(NOT(Invoer!G56=\"\"),Invoer!G56,)","v":0},{"$f":"IF(Invoer!H56=\"\",\"-\",Invoer!H56)","v":"-"}]
[{"$f":"Invoer!A$4&Invoer!B$4&TEXT(Invoer!C$4,\"dd-mm-jjjj\")&TEXT(Invoer!D$4,\"uu:mm\")","v":"00-01-190000:00"},{"$f":"IF(NOT(Invoer!B57=\"\"),Invoer!B57)","v":"05190"},{"$f":"IF(NOT(Invoer!D57=\"\"),Invoer!D57,)","v":0},{"$f":"IF(NOT(Invoer!E57=\"\"),Invoer!E57,)","v":0},{"$f":"IF(NOT(Invoer!F57=\"\"),Invoer!F57,)","v":0},{"$f":"IF(NOT(Invoer!G57=\"\"),Invoer!G57,)","v":0},{"$f":"IF(Invoer!H57=\"\",\"-\",Invoer!H57)","v":"-"}]
[{"$f":"Invoer!A$4&Invoer!B$4&TEXT(Invoer!C$4,\"dd-mm-jjjj\")&TEXT(Invoer!D$4,\"uu:mm\")","v":"00-01-190000:00"},{"$f":"IF(NOT(Invoer!B58=\"\"),Invoer!B58)","v":"05320"},{"$f":"IF(NOT(Invoer!D58=\"\"),Invoer!D58,)","v":0},{"$f":"IF(NOT(Invoer!E58=\"\"),Invoer!E58,)","v":0},{"$f":"IF(NOT(Invoer!F58=\"\"),Invoer!F58,)","v":0},{"$f":"IF(NOT(Invoer!G58=\"\"),Invoer!G58,)","v":0},{"$f":"IF(Invoer!H58=\"\",\"-\",Invoer!H58)","v":"-"}]
[{"$f":"Invoer!A$4&Invoer!B$4&TEXT(Invoer!C$4,\"dd-mm-jjjj\")&TEXT(Invoer!D$4,\"uu:mm\")","v":"00-01-190000:00"},{"$f":"IF(NOT(Invoer!B59=\"\"),Invoer!B59)","v":"05410"},{"$f":"IF(NOT(Invoer!D59=\"\"),Invoer!D59,)","v":0},{"$f":"IF(NOT(Invoer!E59=\"\"),Invoer!E59,)","v":0},{"$f":"IF(NOT(Invoer!F59=\"\"),Invoer!F59,)","v":0},{"$f":"IF(NOT(Invoer!G59=\"\"),Invoer!G59,)","v":0},{"$f":"IF(Invoer!H59=\"\",\"-\",Invoer!H59)","v":"-"}]
[{"$f":"Invoer!A$4&Invoer!B$4&TEXT(Invoer!C$4,\"dd-mm-jjjj\")&TEXT(Invoer!D$4,\"uu:mm\")","v":"00-01-190000:00"},{"$f":"IF(NOT(Invoer!B60=\"\"),Invoer!B60)","v":"05460"},{"$f":"IF(NOT(Invoer!D60=\"\"),Invoer!D60,)","v":0},{"$f":"IF(NOT(Invoer!E60=\"\"),Invoer!E60,)","v":0},{"$f":"IF(NOT(Invoer!F60=\"\"),Invoer!F60,)","v":0},{"$f":"IF(NOT(Invoer!G60=\"\"),Invoer!G60,)","v":0},{"$f":"IF(Invoer!H60=\"\",\"-\",Invoer!H60)","v":"-"}]
[{"$f":"Invoer!A$4&Invoer!B$4&TEXT(Invoer!C$4,\"dd-mm-jjjj\")&TEXT(Invoer!D$4,\"uu:mm\")","v":"00-01-190000:00"},{"$f":"IF(NOT(Invoer!B61=\"\"),Invoer!B61)","v":"05530"},{"$f":"IF(NOT(Invoer!D61=\"\"),Invoer!D61,)","v":0},{"$f":"IF(NOT(Invoer!E61=\"\"),Invoer!E61,)","v":0},{"$f":"IF(NOT(Invoer!F61=\"\"),Invoer!F61,)","v":0},{"$f":"IF(NOT(Invoer!G61=\"\"),Invoer!G61,)","v":0},{"$f":"IF(Invoer!H61=\"\",\"-\",Invoer!H61)","v":"-"}]
[{"$f":"Invoer!A$4&Invoer!B$4&TEXT(Invoer!C$4,\"dd-mm-jjjj\")&TEXT(Invoer!D$4,\"uu:mm\")","v":"00-01-190000:00"},{"$f":"IF(NOT(Invoer!B62=\"\"),Invoer!B62)","v":"05820"},{"$f":"IF(NOT(Invoer!D62=\"\"),Invoer!D62,)","v":0},{"$f":"IF(NOT(Invoer!E62=\"\"),Invoer!E62,)","v":0},{"$f":"IF(NOT(Invoer!F62=\"\"),Invoer!F62,)","v":0},{"$f":"IF(NOT(Invoer!G62=\"\"),Invoer!G62,)","v":0},{"$f":"IF(Invoer!H62=\"\",\"-\",Invoer!H62)","v":"-"}]
[{"$f":"Invoer!A$4&Invoer!B$4&TEXT(Invoer!C$4,\"dd-mm-jjjj\")&TEXT(Invoer!D$4,\"uu:mm\")","v":"00-01-190000:00"},{"$f":"IF(NOT(Invoer!B63=\"\"),Invoer!B63)","v":"05900"},{"$f":"IF(NOT(Invoer!D63=\"\"),Invoer!D63,)","v":0},{"$f":"IF(NOT(Invoer!E63=\"\"),Invoer!E63,)","v":0},{"$f":"IF(NOT(Invoer!F63=\"\"),Invoer!F63,)","v":0},{"$f":"IF(NOT(Invoer!G63=\"\"),Invoer!G63,)","v":0},{"$f":"IF(Invoer!H63=\"\",\"-\",Invoer!H63)","v":"-"}]
[{"$f":"Invoer!A$4&Invoer!B$4&TEXT(Invoer!C$4,\"dd-mm-jjjj\")&TEXT(Invoer!D$4,\"uu:mm\")","v":"00-01-190000:00"},{"$f":"IF(NOT(Invoer!B64=\"\"),Invoer!B64)","v":"05910"},{"$f":"IF(NOT(Invoer!D64=\"\"),Invoer!D64,)","v":0},{"$f":"IF(NOT(Invoer!E64=\"\"),Invoer!E64,)","v":0},{"$f":"IF(NOT(Invoer!F64=\"\"),Invoer!F64,)","v":0},{"$f":"IF(NOT(Invoer!G64=\"\"),Invoer!G64,)","v":0},{"$f":"IF(Invoer!H64=\"\",\"-\",Invoer!H64)","v":"-"}]
[{"$f":"Invoer!A$4&Invoer!B$4&TEXT(Invoer!C$4,\"dd-mm-jjjj\")&TEXT(Invoer!D$4,\"uu:mm\")","v":"00-01-190000:00"},{"$f":"IF(NOT(Invoer!B65=\"\"),Invoer!B65)","v":"05920"},{"$f":"IF(NOT(Invoer!D65=\"\"),Invoer!D65,)","v":0},{"$f":"IF(NOT(Invoer!E65=\"\"),Invoer!E65,)","v":0},{"$f":"IF(NOT(Invoer!F65=\"\"),Invoer!F65,)","v":0},{"$f":"IF(NOT(Invoer!G65=\"\"),Invoer!G65,)","v":0},{"$f":"IF(Invoer!H65=\"\",\"-\",Invoer!H65)","v":"-"}]
[{"$f":"Invoer!A$4&Invoer!B$4&TEXT(Invoer!C$4,\"dd-mm-jjjj\")&TEXT(Invoer!D$4,\"uu:mm\")","v":"00-01-190000:00"},{"$f":"IF(NOT(Invoer!B66=\"\"),Invoer!B66)","v":"06000"},{"$f":"IF(NOT(Invoer!D66=\"\"),Invoer!D66,)","v":0},{"$f":"IF(NOT(Invoer!E66=\"\"),Invoer!E66,)","v":0},{"$f":"IF(NOT(Invoer!F66=\"\"),Invoer!F66,)","v":0},{"$f":"IF(NOT(Invoer!G66=\"\"),Invoer!G66,)","v":0},{"$f":"IF(Invoer!H66=\"\",\"-\",Invoer!H66)","v":"-"}]
[{"$f":"Invoer!A$4&Invoer!B$4&TEXT(Invoer!C$4,\"dd-mm-jjjj\")&TEXT(Invoer!D$4,\"uu:mm\")","v":"00-01-190000:00"},{"$f":"IF(NOT(Invoer!B67=\"\"),Invoer!B67)","v":"06680"},{"$f":"IF(NOT(Invoer!D67=\"\"),Invoer!D67,)","v":0},{"$f":"IF(NOT(Invoer!E67=\"\"),Invoer!E67,)","v":0},{"$f":"IF(NOT(Invoer!F67=\"\"),Invoer!F67,)","v":0},{"$f":"IF(NOT(Invoer!G67=\"\"),Invoer!G67,)","v":0},{"$f":"IF(Invoer!H67=\"\",\"-\",Invoer!H67)","v":"-"}]
[{"$f":"Invoer!A$4&Invoer!B$4&TEXT(Invoer!C$4,\"dd-mm-jjjj\")&TEXT(Invoer!D$4,\"uu:mm\")","v":"00-01-190000:00"},{"$f":"IF(NOT(Invoer!B68=\"\"),Invoer!B68)","v":"06700"},{"$f":"IF(NOT(Invoer!D68=\"\"),Invoer!D68,)","v":0},{"$f":"IF(NOT(Invoer!E68=\"\"),Invoer!E68,)","v":0},{"$f":"IF(NOT(Invoer!F68=\"\"),Invoer!F68,)","v":0},{"$f":"IF(NOT(Invoer!G68=\"\"),Invoer!G68,)","v":0},{"$f":"IF(Invoer!H68=\"\",\"-\",Invoer!H68)","v":"-"}]
[{"$f":"Invoer!A$4&Invoer!B$4&TEXT(Invoer!C$4,\"dd-mm-jjjj\")&TEXT(Invoer!D$4,\"uu:mm\")","v":"00-01-190000:00"},{"$f":"IF(NOT(Invoer!B69=\"\"),Invoer!B69)","v":"06840"},{"$f":"IF(NOT(Invoer!D69=\"\"),Invoer!D69,)","v":0},{"$f":"IF(NOT(Invoer!E69=\"\"),Invoer!E69,)","v":0},{"$f":"IF(NOT(Invoer!F69=\"\"),Invoer!F69,)","v":0},{"$f":"IF(NOT(Invoer!G69=\"\"),Invoer!G69,)","v":0},{"$f":"IF(Invoer!H69=\"\",\"-\",Invoer!H69)","v":"-"}]
[{"$f":"Invoer!A$4&Invoer!B$4&TEXT(Invoer!C$4,\"dd-mm-jjjj\")&TEXT(Invoer!D$4,\"uu:mm\")","v":"00-01-190000:00"},{"$f":"IF(NOT(Invoer!B70=\"\"),Invoer!B70)","v":"08760"},{"$f":"IF(NOT(Invoer!D70=\"\"),Invoer!D70,)","v":0},{"$f":"IF(NOT(Invoer!E70=\"\"),Invoer!E70,)","v":0},{"$f":"IF(NOT(Invoer!F70=\"\"),Invoer!F70,)","v":0},{"$f":"IF(NOT(Invoer!G70=\"\"),Invoer!G70,)","v":0},{"$f":"IF(Invoer!H70=\"\",\"-\",Invoer!H70)","v":"-"}]
[{"$f":"Invoer!A$4&Invoer!B$4&TEXT(Invoer!C$4,\"dd-mm-jjjj\")&TEXT(Invoer!D$4,\"uu:mm\")","v":"00-01-190000:00"},{"$f":"IF(NOT(Invoer!B71=\"\"),Invoer!B71)","v":"09760"},{"$f":"IF(NOT(Invoer!D71=\"\"),Invoer!D71,)","v":0},{"$f":"IF(NOT(Invoer!E71=\"\"),Invoer!E71,)","v":0},{"$f":"IF(NOT(Invoer!F71=\"\"),Invoer!F71,)","v":0},{"$f":"IF(NOT(Invoer!G71=\"\"),Invoer!G71,)","v":0},{"$f":"IF(Invoer!H71=\"\",\"-\",Invoer!H71)","v":"-"}]
[{"$f":"Invoer!A$4&Invoer!B$4&TEXT(Invoer!C$4,\"dd-mm-jjjj\")&TEXT(Invoer!D$4,\"uu:mm\")","v":"00-01-190000:00"},{"$f":"IF(NOT(Invoer!B72=\"\"),Invoer!B72)","v":"09920"},{"$f":"IF(NOT(Invoer!D72=\"\"),Invoer!D72,)","v":0},{"$f":"IF(NOT(Invoer!E72=\"\"),Invoer!E72,)","v":0},{"$f":"IF(NOT(Invoer!F72=\"\"),Invoer!F72,)","v":0},{"$f":"IF(NOT(Invoer!G72=\"\"),Invoer!G72,)","v":0},{"$f":"IF(Invoer!H72=\"\",\"-\",Invoer!H72)","v":"-"}]
[{"$f":"Invoer!A$4&Invoer!B$4&TEXT(Invoer!C$4,\"dd-mm-jjjj\")&TEXT(Invoer!D$4,\"uu:mm\")","v":"00-01-190000:00"},{"$f":"IF(NOT(Invoer!B73=\"\"),Invoer!B73)","v":"10110"},{"$f":"IF(NOT(Invoer!D73=\"\"),Invoer!D73,)","v":0},{"$f":"IF(NOT(Invoer!E73=\"\"),Invoer!E73,)","v":0},{"$f":"IF(NOT(Invoer!F73=\"\"),Invoer!F73,)","v":0},{"$f":"IF(NOT(Invoer!G73=\"\"),Invoer!G73,)","v":0},{"$f":"IF(Invoer!H73=\"\",\"-\",Invoer!H73)","v":"-"}]
[{"$f":"Invoer!A$4&Invoer!B$4&TEXT(Invoer!C$4,\"dd-mm-jjjj\")&TEXT(Invoer!D$4,\"uu:mm\")","v":"00-01-190000:00"},{"$f":"IF(NOT(Invoer!B74=\"\"),Invoer!B74)","v":10201},{"$f":"IF(NOT(Invoer!D74=\"\"),Invoer!D74,)","v":0},{"$f":"IF(NOT(Invoer!E74=\"\"),Invoer!E74,)","v":0},{"$f":"IF(NOT(Invoer!F74=\"\"),Invoer!F74,)","v":0},{"$f":"IF(NOT(Invoer!G74=\"\"),Invoer!G74,)","v":0},{"$f":"IF(Invoer!H74=\"\",\"-\",Invoer!H74)","v":"-"}]
[{"$f":"Invoer!A$4&Invoer!B$4&TEXT(Invoer!C$4,\"dd-mm-jjjj\")&TEXT(Invoer!D$4,\"uu:mm\")","v":"00-01-190000:00"},{"$f":"IF(NOT(Invoer!B75=\"\"),Invoer!B75)","v":"10660"},{"$f":"IF(NOT(Invoer!D75=\"\"),Invoer!D75,)","v":0},{"$f":"IF(NOT(Invoer!E75=\"\"),Invoer!E75,)","v":0},{"$f":"IF(NOT(Invoer!F75=\"\"),Invoer!F75,)","v":0},{"$f":"IF(NOT(Invoer!G75=\"\"),Invoer!G75,)","v":0},{"$f":"IF(Invoer!H75=\"\",\"-\",Invoer!H75)","v":"-"}]
[{"$f":"Invoer!A$4&Invoer!B$4&TEXT(Invoer!C$4,\"dd-mm-jjjj\")&TEXT(Invoer!D$4,\"uu:mm\")","v":"00-01-190000:00"},{"$f":"IF(NOT(Invoer!B76=\"\"),Invoer!B76)","v":"10840"},{"$f":"IF(NOT(Invoer!D76=\"\"),Invoer!D76,)","v":0},{"$f":"IF(NOT(Invoer!E76=\"\"),Invoer!E76,)","v":0},{"$f":"IF(NOT(Invoer!F76=\"\"),Invoer!F76,)","v":0},{"$f":"IF(NOT(Invoer!G76=\"\"),Invoer!G76,)","v":0},{"$f":"IF(Invoer!H76=\"\",\"-\",Invoer!H76)","v":"-"}]
[{"$f":"Invoer!A$4&Invoer!B$4&TEXT(Invoer!C$4,\"dd-mm-jjjj\")&TEXT(Invoer!D$4,\"uu:mm\")","v":"00-01-190000:00"},{"$f":"IF(NOT(Invoer!B77=\"\"),Invoer!B77)","v":"10990"},{"$f":"IF(NOT(Invoer!D77=\"\"),Invoer!D77,)","v":0},{"$f":"IF(NOT(Invoer!E77=\"\"),Invoer!E77,)","v":0},{"$f":"IF(NOT(Invoer!F77=\"\"),Invoer!F77,)","v":0},{"$f":"IF(NOT(Invoer!G77=\"\"),Invoer!G77,)","v":0},{"$f":"IF(Invoer!H77=\"\",\"-\",Invoer!H77)","v":"-"}]
[{"$f":"Invoer!A$4&Invoer!B$4&TEXT(Invoer!C$4,\"dd-mm-jjjj\")&TEXT(Invoer!D$4,\"uu:mm\")","v":"00-01-190000:00"},{"$f":"IF(NOT(Invoer!B78=\"\"),Invoer!B78)","v":"11370"},{"$f":"IF(NOT(Invoer!D78=\"\"),Invoer!D78,)","v":0},{"$f":"IF(NOT(Invoer!E78=\"\"),Invoer!E78,)","v":0},{"$f":"IF(NOT(Invoer!F78=\"\"),Invoer!F78,)","v":0},{"$f":"IF(NOT(Invoer!G78=\"\"),Invoer!G78,)","v":0},{"$f":"IF(Invoer!H78=\"\",\"-\",Invoer!H78)","v":"-"}]
[{"$f":"Invoer!A$4&Invoer!B$4&TEXT(Invoer!C$4,\"dd-mm-jjjj\")&TEXT(Invoer!D$4,\"uu:mm\")","v":"00-01-190000:00"},{"$f":"IF(NOT(Invoer!B79=\"\"),Invoer!B79)","v":"11390"},{"$f":"IF(NOT(Invoer!D79=\"\"),Invoer!D79,)","v":0},{"$f":"IF(NOT(Invoer!E79=\"\"),Invoer!E79,)","v":0},{"$f":"IF(NOT(Invoer!F79=\"\"),Invoer!F79,)","v":0},{"$f":"IF(NOT(Invoer!G79=\"\"),Invoer!G79,)","v":0},{"$f":"IF(Invoer!H79=\"\",\"-\",Invoer!H79)","v":"-"}]
[{"$f":"Invoer!A$4&Invoer!B$4&TEXT(Invoer!C$4,\"dd-mm-jjjj\")&TEXT(Invoer!D$4,\"uu:mm\")","v":"00-01-190000:00"},{"$f":"IF(NOT(Invoer!B80=\"\"),Invoer!B80)","v":"11460"},{"$f":"IF(NOT(Invoer!D80=\"\"),Invoer!D80,)","v":0},{"$f":"IF(NOT(Invoer!E80=\"\"),Invoer!E80,)","v":0},{"$f":"IF(NOT(Invoer!F80=\"\"),Invoer!F80,)","v":0},{"$f":"IF(NOT(Invoer!G80=\"\"),Invoer!G80,)","v":0},{"$f":"IF(Invoer!H80=\"\",\"-\",Invoer!H80)","v":"-"}]
[{"$f":"Invoer!A$4&Invoer!B$4&TEXT(Invoer!C$4,\"dd-mm-jjjj\")&TEXT(Invoer!D$4,\"uu:mm\")","v":"00-01-190000:00"},{"$f":"IF(NOT(Invoer!B81=\"\"),Invoer!B81)","v":"11870"},{"$f":"IF(NOT(Invoer!D81=\"\"),Invoer!D81,)","v":0},{"$f":"IF(NOT(Invoer!E81=\"\"),Invoer!E81,)","v":0},{"$f":"IF(NOT(Invoer!F81=\"\"),Invoer!F81,)","v":0},{"$f":"IF(NOT(Invoer!G81=\"\"),Invoer!G81,)","v":0},{"$f":"IF(Invoer!H81=\"\",\"-\",Invoer!H81)","v":"-"}]
[{"$f":"Invoer!A$4&Invoer!B$4&TEXT(Invoer!C$4,\"dd-mm-jjjj\")&TEXT(Invoer!D$4,\"uu:mm\")","v":"00-01-190000:00"},{"$f":"IF(NOT(Invoer!B82=\"\"),Invoer!B82)","v":"11980"},{"$f":"IF(NOT(Invoer!D82=\"\"),Invoer!D82,)","v":0},{"$f":"IF(NOT(Invoer!E82=\"\"),Invoer!E82,)","v":0},{"$f":"IF(NOT(Invoer!F82=\"\"),Invoer!F82,)","v":0},{"$f":"IF(NOT(Invoer!G82=\"\"),Invoer!G82,)","v":0},{"$f":"IF(Invoer!H82=\"\",\"-\",Invoer!H82)","v":"-"}]
[{"$f":"Invoer!A$4&Invoer!B$4&TEXT(Invoer!C$4,\"dd-mm-jjjj\")&TEXT(Invoer!D$4,\"uu:mm\")","v":"00-01-190000:00"},{"$f":"IF(NOT(Invoer!B83=\"\"),Invoer!B83)","v":"12010"},{"$f":"IF(NOT(Invoer!D83=\"\"),Invoer!D83,)","v":0},{"$f":"IF(NOT(Invoer!E83=\"\"),Invoer!E83,)","v":0},{"$f":"IF(NOT(Invoer!F83=\"\"),Invoer!F83,)","v":0},{"$f":"IF(NOT(Invoer!G83=\"\"),Invoer!G83,)","v":0},{"$f":"IF(Invoer!H83=\"\",\"-\",Invoer!H83)","v":"-"}]
[{"$f":"Invoer!A$4&Invoer!B$4&TEXT(Invoer!C$4,\"dd-mm-jjjj\")&TEXT(Invoer!D$4,\"uu:mm\")","v":"00-01-190000:00"},{"$f":"IF(NOT(Invoer!B84=\"\"),Invoer!B84)","v":"13110"},{"$f":"IF(NOT(Invoer!D84=\"\"),Invoer!D84,)","v":0},{"$f":"IF(NOT(Invoer!E84=\"\"),Invoer!E84,)","v":0},{"$f":"IF(NOT(Invoer!F84=\"\"),Invoer!F84,)","v":0},{"$f":"IF(NOT(Invoer!G84=\"\"),Invoer!G84,)","v":0},{"$f":"IF(Invoer!H84=\"\",\"-\",Invoer!H84)","v":"-"}]
[{"$f":"Invoer!A$4&Invoer!B$4&TEXT(Invoer!C$4,\"dd-mm-jjjj\")&TEXT(Invoer!D$4,\"uu:mm\")","v":"00-01-190000:00"},{"$f":"IF(NOT(Invoer!B85=\"\"),Invoer!B85)","v":"13640"},{"$f":"IF(NOT(Invoer!D85=\"\"),Invoer!D85,)","v":0},{"$f":"IF(NOT(Invoer!E85=\"\"),Invoer!E85,)","v":0},{"$f":"IF(NOT(Invoer!F85=\"\"),Invoer!F85,)","v":0},{"$f":"IF(NOT(Invoer!G85=\"\"),Invoer!G85,)","v":0},{"$f":"IF(Invoer!H85=\"\",\"-\",Invoer!H85)","v":"-"}]
[{"$f":"Invoer!A$4&Invoer!B$4&TEXT(Invoer!C$4,\"dd-mm-jjjj\")&TEXT(Invoer!D$4,\"uu:mm\")","v":"00-01-190000:00"},{"$f":"IF(NOT(Invoer!B86=\"\"),Invoer!B86)","v":14374},{"$f":"IF(NOT(Invoer!D86=\"\"),Invoer!D86,)","v":0},{"$f":"IF(NOT(Invoer!E86=\"\"),Invoer!E86,)","v":0},{"$f":"IF(NOT(Invoer!F86=\"\"),Invoer!F86,)","v":0},{"$f":"IF(NOT(Invoer!G86=\"\"),Invoer!G86,)","v":0},{"$f":"IF(Invoer!H86=\"\",\"-\",Invoer!H86)","v":"-"}]
[{"$f":"Invoer!A$4&Invoer!B$4&TEXT(Invoer!C$4,\"dd-mm-jjjj\")&TEXT(Invoer!D$4,\"uu:mm\")","v":"00-01-190000:00"},{"$f":"IF(NOT(Invoer!B87=\"\"),Invoer!B87)","v":"14620"},{"$f":"IF(NOT(Invoer!D87=\"\"),Invoer!D87,)","v":0},{"$f":"IF(NOT(Invoer!E87=\"\"),Invoer!E87,)","v":0},{"$f":"IF(NOT(Invoer!F87=\"\"),Invoer!F87,)","v":0},{"$f":"IF(NOT(Invoer!G87=\"\"),Invoer!G87,)","v":0},{"$f":"IF(Invoer!H87=\"\",\"-\",Invoer!H87)","v":"-"}]
[{"$f":"Invoer!A$4&Invoer!B$4&TEXT(Invoer!C$4,\"dd-mm-jjjj\")&TEXT(Invoer!D$4,\"uu:mm\")","v":"00-01-190000:00"},{"$f":"IF(NOT(Invoer!B88=\"\"),Invoer!B88)","v":"14640"},{"$f":"IF(NOT(Invoer!D88=\"\"),Invoer!D88,)","v":0},{"$f":"IF(NOT(Invoer!E88=\"\"),Invoer!E88,)","v":0},{"$f":"IF(NOT(Invoer!F88=\"\"),Invoer!F88,)","v":0},{"$f":"IF(NOT(Invoer!G88=\"\"),Invoer!G88,)","v":0},{"$f":"IF(Invoer!H88=\"\",\"-\",Invoer!H88)","v":"-"}]
[{"$f":"Invoer!A$4&Invoer!B$4&TEXT(Invoer!C$4,\"dd-mm-jjjj\")&TEXT(Invoer!D$4,\"uu:mm\")","v":"00-01-190000:00"},{"$f":"IF(NOT(Invoer!B89=\"\"),Invoer!B89)","v":"14870"},{"$f":"IF(NOT(Invoer!D89=\"\"),Invoer!D89,)","v":0},{"$f":"IF(NOT(Invoer!E89=\"\"),Invoer!E89,)","v":0},{"$f":"IF(NOT(Invoer!F89=\"\"),Invoer!F89,)","v":0},{"$f":"IF(NOT(Invoer!G89=\"\"),Invoer!G89,)","v":0},{"$f":"IF(Invoer!H89=\"\",\"-\",Invoer!H89)","v":"-"}]
[{"$f":"Invoer!A$4&Invoer!B$4&TEXT(Invoer!C$4,\"dd-mm-jjjj\")&TEXT(Invoer!D$4,\"uu:mm\")","v":"00-01-190000:00"},{"$f":"IF(NOT(Invoer!B90=\"\"),Invoer!B90)","v":"15390"},{"$f":"IF(NOT(Invoer!D90=\"\"),Invoer!D90,)","v":0},{"$f":"IF(NOT(Invoer!E90=\"\"),Invoer!E90,)","v":0},{"$f":"IF(NOT(Invoer!F90=\"\"),Invoer!F90,)","v":0},{"$f":"IF(NOT(Invoer!G90=\"\"),Invoer!G90,)","v":0},{"$f":"IF(Invoer!H90=\"\",\"-\",Invoer!H90)","v":"-"}]
[{"$f":"Invoer!A$4&Invoer!B$4&TEXT(Invoer!C$4,\"dd-mm-jjjj\")&TEXT(Invoer!D$4,\"uu:mm\")","v":"00-01-190000:00"},{"$f":"IF(NOT(Invoer!B91=\"\"),Invoer!B91)","v":"15490"},{"$f":"IF(NOT(Invoer!D91=\"\"),Invoer!D91,)","v":0},{"$f":"IF(NOT(Invoer!E91=\"\"),Invoer!E91,)","v":0},{"$f":"IF(NOT(Invoer!F91=\"\"),Invoer!F91,)","v":0},{"$f":"IF(NOT(Invoer!G91=\"\"),Invoer!G91,)","v":0},{"$f":"IF(Invoer!H91=\"\",\"-\",Invoer!H91)","v":"-"}]
[{"$f":"Invoer!A$4&Invoer!B$4&TEXT(Invoer!C$4,\"dd-mm-jjjj\")&TEXT(Invoer!D$4,\"uu:mm\")","v":"00-01-190000:00"},{"$f":"IF(NOT(Invoer!B92=\"\"),Invoer!B92)","v":"15600"},{"$f":"IF(NOT(Invoer!D92=\"\"),Invoer!D92,)","v":0},{"$f":"IF(NOT(Invoer!E92=\"\"),Invoer!E92,)","v":0},{"$f":"IF(NOT(Invoer!F92=\"\"),Invoer!F92,)","v":0},{"$f":"IF(NOT(Invoer!G92=\"\"),Invoer!G92,)","v":0},{"$f":"IF(Invoer!H92=\"\",\"-\",Invoer!H92)","v":"-"}]
[{"$f":"Invoer!A$4&Invoer!B$4&TEXT(Invoer!C$4,\"dd-mm-jjjj\")&TEXT(Invoer!D$4,\"uu:mm\")","v":"00-01-190000:00"},{"$f":"IF(NOT(Invoer!B93=\"\"),Invoer!B93)","v":15671},{"$f":"IF(NOT(Invoer!D93=\"\"),Invoer!D93,)","v":0},{"$f":"IF(NOT(Invoer!E93=\"\"),Invoer!E93,)","v":0},{"$f":"IF(NOT(Invoer!F93=\"\"),Invoer!F93,)","v":0},{"$f":"IF(NOT(Invoer!G93=\"\"),Invoer!G93,)","v":0},{"$f":"IF(Invoer!H93=\"\",\"-\",Invoer!H93)","v":"-"}]
[{"$f":"Invoer!A$4&Invoer!B$4&TEXT(Invoer!C$4,\"dd-mm-jjjj\")&TEXT(Invoer!D$4,\"uu:mm\")","v":"00-01-190000:00"},{"$f":"IF(NOT(Invoer!B94=\"\"),Invoer!B94)","v":"15820"},{"$f":"IF(NOT(Invoer!D94=\"\"),Invoer!D94,)","v":0},{"$f":"IF(NOT(Invoer!E94=\"\"),Invoer!E94,)","v":0},{"$f":"IF(NOT(Invoer!F94=\"\"),Invoer!F94,)","v":0},{"$f":"IF(NOT(Invoer!G94=\"\"),Invoer!G94,)","v":0},{"$f":"IF(Invoer!H94=\"\",\"-\",Invoer!H94)","v":"-"}]
[{"$f":"Invoer!A$4&Invoer!B$4&TEXT(Invoer!C$4,\"dd-mm-jjjj\")&TEXT(Invoer!D$4,\"uu:mm\")","v":"00-01-190000:00"},{"$f":"IF(NOT(Invoer!B95=\"\"),Invoer!B95)","v":"16360"},{"$f":"IF(NOT(Invoer!D95=\"\"),Invoer!D95,)","v":0},{"$f":"IF(NOT(Invoer!E95=\"\"),Invoer!E95,)","v":0},{"$f":"IF(NOT(Invoer!F95=\"\"),Invoer!F95,)","v":0},{"$f":"IF(NOT(Invoer!G95=\"\"),Invoer!G95,)","v":0},{"$f":"IF(Invoer!H95=\"\",\"-\",Invoer!H95)","v":"-"}]
[{"$f":"Invoer!A$4&Invoer!B$4&TEXT(Invoer!C$4,\"dd-mm-jjjj\")&TEXT(Invoer!D$4,\"uu:mm\")","v":"00-01-190000:00"},{"$f":"IF(NOT(Invoer!B96=\"\"),Invoer!B96)","v":"16490"},{"$f":"IF(NOT(Invoer!D96=\"\"),Invoer!D96,)","v":0},{"$f":"IF(NOT(Invoer!E96=\"\"),Invoer!E96,)","v":0},{"$f":"IF(NOT(Invoer!F96=\"\"),Invoer!F96,)","v":0},{"$f":"IF(NOT(Invoer!G96=\"\"),Invoer!G96,)","v":0},{"$f":"IF(Invoer!H96=\"\",\"-\",Invoer!H96)","v":"-"}]
[{"$f":"Invoer!A$4&Invoer!B$4&TEXT(Invoer!C$4,\"dd-mm-jjjj\")&TEXT(Invoer!D$4,\"uu:mm\")","v":"00-01-190000:00"},{"$f":"IF(NOT(Invoer!B97=\"\"),Invoer!B97)","v":"16530"},{"$f":"IF(NOT(Invoer!D97=\"\"),Invoer!D97,)","v":0},{"$f":"IF(NOT(Invoer!E97=\"\"),Invoer!E97,)","v":0},{"$f":"IF(NOT(Invoer!F97=\"\"),Invoer!F97,)","v":0},{"$f":"IF(NOT(Invoer!G97=\"\"),Invoer!G97,)","v":0},{"$f":"IF(Invoer!H97=\"\",\"-\",Invoer!H97)","v":"-"}]
[{"$f":"Invoer!A$4&Invoer!B$4&TEXT(Invoer!C$4,\"dd-mm-jjjj\")&TEXT(Invoer!D$4,\"uu:mm\")","v":"00-01-190000:00"},{"$f":"IF(NOT(Invoer!B98=\"\"),Invoer!B98)","v":"16540"},{"$f":"IF(NOT(Invoer!D98=\"\"),Invoer!D98,)","v":0},{"$f":"IF(NOT(Invoer!E98=\"\"),Invoer!E98,)","v":0},{"$f":"IF(NOT(Invoer!F98=\"\"),Invoer!F98,)","v":0},{"$f":"IF(NOT(Invoer!G98=\"\"),Invoer!G98,)","v":0},{"$f":"IF(Invoer!H98=\"\",\"-\",Invoer!H98)","v":"-"}]
[{"$f":"Invoer!A$4&Invoer!B$4&TEXT(Invoer!C$4,\"dd-mm-jjjj\")&TEXT(Invoer!D$4,\"uu:mm\")","v":"00-01-190000:00"},{"$f":"IF(NOT(Invoer!B99=\"\"),Invoer!B99)","v":18770},{"$f":"IF(NOT(Invoer!D99=\"\"),Invoer!D99,)","v":0},{"$f":"IF(NOT(Invoer!E99=\"\"),Invoer!E99,)","v":0},{"$f":"IF(NOT(Invoer!F99=\"\"),Invoer!F99,)","v":0},{"$f":"IF(NOT(Invoer!G99=\"\"),Invoer!G99,)","v":0},{"$f":"IF(Invoer!H99=\"\",\"-\",Invoer!H99)","v":"-"}]
[{"$f":"Invoer!A$4&Invoer!B$4&TEXT(Invoer!C$4,\"dd-mm-jjjj\")&TEXT(Invoer!D$4,\"uu:mm\")","v":"00-01-190000:00"},{"$f":"IF(NOT(Invoer!B100=\"\"),Invoer!B100)","v":false},{"$f":"IF(NOT(Invoer!D100=\"\"),Invoer!D100,)","v":0},{"$f":"IF(NOT(Invoer!E100=\"\"),Invoer!E100,)","v":0},{"$f":"IF(NOT(Invoer!F100=\"\"),Invoer!F100,)","v":0},{"$f":"IF(NOT(Invoer!G100=\"\"),Invoer!G100,)","v":0},{"$f":"IF(Invoer!H100=\"\",\"-\",Invoer!H100)","v":"-"}]
[{"$f":"Invoer!A$4&Invoer!B$4&TEXT(Invoer!C$4,\"dd-mm-jjjj\")&TEXT(Invoer!D$4,\"uu:mm\")","v":"00-01-190000:00"},{"$f":"IF(NOT(Invoer!B101=\"\"),Invoer!B101)","v":false},{"$f":"IF(NOT(Invoer!D101=\"\"),Invoer!D101,)","v":0},{"$f":"IF(NOT(Invoer!E101=\"\"),Invoer!E101,)","v":0},{"$f":"IF(NOT(Invoer!F101=\"\"),Invoer!F101,)","v":0},{"$f":"IF(NOT(Invoer!G101=\"\"),Invoer!G101,)","v":0},{"$f":"IF(Invoer!H101=\"\",\"-\",Invoer!H101)","v":"-"}]
[{"$f":"Invoer!A$4&Invoer!B$4&TEXT(Invoer!C$4,\"dd-mm-jjjj\")&TEXT(Invoer!D$4,\"uu:mm\")","v":"00-01-190000:00"},{"$f":"IF(NOT(Invoer!B102=\"\"),Invoer!B102)","v":false},{"$f":"IF(NOT(Invoer!D102=\"\"),Invoer!D102,)","v":0},{"$f":"IF(NOT(Invoer!E102=\"\"),Invoer!E102,)","v":0},{"$f":"IF(NOT(Invoer!F102=\"\"),Invoer!F102,)","v":0},{"$f":"IF(NOT(Invoer!G102=\"\"),Invoer!G102,)","v":0},{"$f":"IF(Invoer!H102=\"\",\"-\",Invoer!H102)","v":"-"}]
[{"$f":"Invoer!A$4&Invoer!B$4&TEXT(Invoer!C$4,\"dd-mm-jjjj\")&TEXT(Invoer!D$4,\"uu:mm\")","v":"00-01-190000:00"},{"$f":"IF(NOT(Invoer!B103=\"\"),Invoer!B103)","v":false},{"$f":"IF(NOT(Invoer!D103=\"\"),Invoer!D103,)","v":0},{"$f":"IF(NOT(Invoer!E103=\"\"),Invoer!E103,)","v":0},{"$f":"IF(NOT(Invoer!F103=\"\"),Invoer!F103,)","v":0},{"$f":"IF(NOT(Invoer!G103=\"\"),Invoer!G103,)","v":0},{"$f":"IF(Invoer!H103=\"\",\"-\",Invoer!H103)","v":"-"}]
[{"$f":"Invoer!A$4&Invoer!B$4&TEXT(Invoer!C$4,\"dd-mm-jjjj\")&TEXT(Invoer!D$4,\"uu:mm\")","v":"00-01-190000:00"},{"$f":"IF(NOT(Invoer!B104=\"\"),Invoer!B104)","v":false},{"$f":"IF(NOT(Invoer!D104=\"\"),Invoer!D104,)","v":0},{"$f":"IF(NOT(Invoer!E104=\"\"),Invoer!E104,)","v":0},{"$f":"IF(NOT(Invoer!F104=\"\"),Invoer!F104,)","v":0},{"$f":"IF(NOT(Invoer!G104=\"\"),Invoer!G104,)","v":0},{"$f":"IF(Invoer!H104=\"\",\"-\",Invoer!H104)","v":"-"}]
[{"$f":"Invoer!A$4&Invoer!B$4&TEXT(Invoer!C$4,\"dd-mm-jjjj\")&TEXT(Invoer!D$4,\"uu:mm\")","v":"00-01-190000:00"},{"$f":"IF(NOT(Invoer!B105=\"\"),Invoer!B105)","v":false},{"$f":"IF(NOT(Invoer!D105=\"\"),Invoer!D105,)","v":0},{"$f":"IF(NOT(Invoer!E105=\"\"),Invoer!E105,)","v":0},{"$f":"IF(NOT(Invoer!F105=\"\"),Invoer!F105,)","v":0},{"$f":"IF(NOT(Invoer!G105=\"\"),Invoer!G105,)","v":0},{"$f":"IF(Invoer!H105=\"\",\"-\",Invoer!H105)","v":"-"}]
[{"$f":"Invoer!A$4&Invoer!B$4&TEXT(Invoer!C$4,\"dd-mm-jjjj\")&TEXT(Invoer!D$4,\"uu:mm\")","v":"00-01-190000:00"},{"$f":"IF(NOT(Invoer!B106=\"\"),Invoer!B106)","v":false},{"$f":"IF(NOT(Invoer!D106=\"\"),Invoer!D106,)","v":0},{"$f":"IF(NOT(Invoer!E106=\"\"),Invoer!E106,)","v":0},{"$f":"IF(NOT(Invoer!F106=\"\"),Invoer!F106,)","v":0},{"$f":"IF(NOT(Invoer!G106=\"\"),Invoer!G106,)","v":0},{"$f":"IF(Invoer!H106=\"\",\"-\",Invoer!H106)","v":"-"}]
[{"$f":"Invoer!A$4&Invoer!B$4&TEXT(Invoer!C$4,\"dd-mm-jjjj\")&TEXT(Invoer!D$4,\"uu:mm\")","v":"00-01-190000:00"},{"$f":"IF(NOT(Invoer!B107=\"\"),Invoer!B107)","v":false},{"$f":"IF(NOT(Invoer!D107=\"\"),Invoer!D107,)","v":0},{"$f":"IF(NOT(Invoer!E107=\"\"),Invoer!E107,)","v":0},{"$f":"IF(NOT(Invoer!F107=\"\"),Invoer!F107,)","v":0},{"$f":"IF(NOT(Invoer!G107=\"\"),Invoer!G107,)","v":0},{"$f":"IF(Invoer!H107=\"\",\"-\",Invoer!H107)","v":"-"}]
[{"$f":"Invoer!A$4&Invoer!B$4&TEXT(Invoer!C$4,\"dd-mm-jjjj\")&TEXT(Invoer!D$4,\"uu:mm\")","v":"00-01-190000:00"},{"$f":"IF(NOT(Invoer!B108=\"\"),Invoer!B108)","v":false},{"$f":"IF(NOT(Invoer!D108=\"\"),Invoer!D108,)","v":0},{"$f":"IF(NOT(Invoer!E108=\"\"),Invoer!E108,)","v":0},{"$f":"IF(NOT(Invoer!F108=\"\"),Invoer!F108,)","v":0},{"$f":"IF(NOT(Invoer!G108=\"\"),Invoer!G108,)","v":0},{"$f":"IF(Invoer!H108=\"\",\"-\",Invoer!H108)","v":"-"}]
[{"$f":"Invoer!A$4&Invoer!B$4&TEXT(Invoer!C$4,\"dd-mm-jjjj\")&TEXT(Invoer!D$4,\"uu:mm\")","v":"00-01-190000:00"},{"$f":"IF(NOT(Invoer!B109=\"\"),Invoer!B109)","v":false},{"$f":"IF(NOT(Invoer!D109=\"\"),Invoer!D109,)","v":0},{"$f":"IF(NOT(Invoer!E109=\"\"),Invoer!E109,)","v":0},{"$f":"IF(NOT(Invoer!F109=\"\"),Invoer!F109,)","v":0},{"$f":"IF(NOT(Invoer!G109=\"\"),Invoer!G109,)","v":0},{"$f":"IF(Invoer!H109=\"\",\"-\",Invoer!H109)","v":"-"}]
[{"$f":"Invoer!A$4&Invoer!B$4&TEXT(Invoer!C$4,\"dd-mm-jjjj\")&TEXT(Invoer!D$4,\"uu:mm\")","v":"00-01-190000:00"},{"$f":"IF(NOT(Invoer!B110=\"\"),Invoer!B110)","v":false},{"$f":"IF(NOT(Invoer!D110=\"\"),Invoer!D110,)","v":0},{"$f":"IF(NOT(Invoer!E110=\"\"),Invoer!E110,)","v":0},{"$f":"IF(NOT(Invoer!F110=\"\"),Invoer!F110,)","v":0},{"$f":"IF(NOT(Invoer!G110=\"\"),Invoer!G110,)","v":0},{"$f":"IF(Invoer!H110=\"\",\"-\",Invoer!H110)","v":"-"}]
[{"$f":"Invoer!A$4&Invoer!B$4&TEXT(Invoer!C$4,\"dd-mm-jjjj\")&TEXT(Invoer!D$4,\"uu:mm\")","v":"00-01-190000:00"},{"$f":"IF(NOT(Invoer!B111=\"\"),Invoer!B111)","v":false},{"$f":"IF(NOT(Invoer!D111=\"\"),Invoer!D111,)","v":0},{"$f":"IF(NOT(Invoer!E111=\"\"),Invoer!E111,)","v":0},{"$f":"IF(NOT(Invoer!F111=\"\"),Invoer!F111,)","v":0},{"$f":"IF(NOT(Invoer!G111=\"\"),Invoer!G111,)","v":0},{"$f":"IF(Invoer!H111=\"\",\"-\",Invoer!H111)","v":"-"}]
[{"$f":"Invoer!A$4&Invoer!B$4&TEXT(Invoer!C$4,\"dd-mm-jjjj\")&TEXT(Invoer!D$4,\"uu:mm\")","v":"00-01-190000:00"},{"$f":"IF(NOT(Invoer!B112=\"\"),Invoer!B112)","v":false},{"$f":"IF(NOT(Invoer!D112=\"\"),Invoer!D112,)","v":0},{"$f":"IF(NOT(Invoer!E112=\"\"),Invoer!E112,)","v":0},{"$f":"IF(NOT(Invoer!F112=\"\"),Invoer!F112,)","v":0},{"$f":"IF(NOT(Invoer!G112=\"\"),Invoer!G112,)","v":0},{"$f":"IF(Invoer!H112=\"\",\"-\",Invoer!H112)","v":"-"}]
[{"$f":"Invoer!A$4&Invoer!B$4&TEXT(Invoer!C$4,\"dd-mm-jjjj\")&TEXT(Invoer!D$4,\"uu:mm\")","v":"00-01-190000:00"},{"$f":"IF(NOT(Invoer!B113=\"\"),Invoer!B113)","v":false},{"$f":"IF(NOT(Invoer!D113=\"\"),Invoer!D113,)","v":0},{"$f":"IF(NOT(Invoer!E113=\"\"),Invoer!E113,)","v":0},{"$f":"IF(NOT(Invoer!F113=\"\"),Invoer!F113,)","v":0},{"$f":"IF(NOT(Invoer!G113=\"\"),Invoer!G113,)","v":0},{"$f":"IF(Invoer!H113=\"\",\"-\",Invoer!H113)","v":"-"}]
[{"$f":"Invoer!A$4&Invoer!B$4&TEXT(Invoer!C$4,\"dd-mm-jjjj\")&TEXT(Invoer!D$4,\"uu:mm\")","v":"00-01-190000:00"},{"$f":"IF(NOT(Invoer!B114=\"\"),Invoer!B114)","v":false},{"$f":"IF(NOT(Invoer!D114=\"\"),Invoer!D114,)","v":0},{"$f":"IF(NOT(Invoer!E114=\"\"),Invoer!E114,)","v":0},{"$f":"IF(NOT(Invoer!F114=\"\"),Invoer!F114,)","v":0},{"$f":"IF(NOT(Invoer!G114=\"\"),Invoer!G114,)","v":0},{"$f":"IF(Invoer!H114=\"\",\"-\",Invoer!H114)","v":"-"}]
[{"$f":"Invoer!A$4&Invoer!B$4&TEXT(Invoer!C$4,\"dd-mm-jjjj\")&TEXT(Invoer!D$4,\"uu:mm\")","v":"00-01-190000:00"},{"$f":"IF(NOT(Invoer!B115=\"\"),Invoer!B115)","v":false},{"$f":"IF(NOT(Invoer!D115=\"\"),Invoer!D115,)","v":0},{"$f":"IF(NOT(Invoer!E115=\"\"),Invoer!E115,)","v":0},{"$f":"IF(NOT(Invoer!F115=\"\"),Invoer!F115,)","v":0},{"$f":"IF(NOT(Invoer!G115=\"\"),Invoer!G115,)","v":0},{"$f":"IF(Invoer!H115=\"\",\"-\",Invoer!H115)","v":"-"}]
[{"$f":"Invoer!A$4&Invoer!B$4&TEXT(Invoer!C$4,\"dd-mm-jjjj\")&TEXT(Invoer!D$4,\"uu:mm\")","v":"00-01-190000:00"},{"$f":"IF(NOT(Invoer!B116=\"\"),Invoer!B116)","v":false},{"$f":"IF(NOT(Invoer!D116=\"\"),Invoer!D116,)","v":0},{"$f":"IF(NOT(Invoer!E116=\"\"),Invoer!E116,)","v":0},{"$f":"IF(NOT(Invoer!F116=\"\"),Invoer!F116,)","v":0},{"$f":"IF(NOT(Invoer!G116=\"\"),Invoer!G116,)","v":0},{"$f":"IF(Invoer!H116=\"\",\"-\",Invoer!H116)","v":"-"}]
[{"$f":"Invoer!A$4&Invoer!B$4&TEXT(Invoer!C$4,\"dd-mm-jjjj\")&TEXT(Invoer!D$4,\"uu:mm\")","v":"00-01-190000:00"},{"$f":"IF(NOT(Invoer!B117=\"\"),Invoer!B117)","v":false},{"$f":"IF(NOT(Invoer!D117=\"\"),Invoer!D117,)","v":0},{"$f":"IF(NOT(Invoer!E117=\"\"),Invoer!E117,)","v":0},{"$f":"IF(NOT(Invoer!F117=\"\"),Invoer!F117,)","v":0},{"$f":"IF(NOT(Invoer!G117=\"\"),Invoer!G117,)","v":0},{"$f":"IF(Invoer!H117=\"\",\"-\",Invoer!H117)","v":"-"}]
[{"$f":"Invoer!A$4&Invoer!B$4&TEXT(Invoer!C$4,\"dd-mm-jjjj\")&TEXT(Invoer!D$4,\"uu:mm\")","v":"00-01-190000:00"},{"$f":"IF(NOT(Invoer!B118=\"\"),Invoer!B118)","v":false},{"$f":"IF(NOT(Invoer!D118=\"\"),Invoer!D118,)","v":0},{"$f":"IF(NOT(Invoer!E118=\"\"),Invoer!E118,)","v":0},{"$f":"IF(NOT(Invoer!F118=\"\"),Invoer!F118,)","v":0},{"$f":"IF(NOT(Invoer!G118=\"\"),Invoer!G118,)","v":0},{"$f":"IF(Invoer!H118=\"\",\"-\",Invoer!H118)","v":"-"}]
[{"$f":"Invoer!A$4&Invoer!B$4&TEXT(Invoer!C$4,\"dd-mm-jjjj\")&TEXT(Invoer!D$4,\"uu:mm\")","v":"00-01-190000:00"},{"$f":"IF(NOT(Invoer!B119=\"\"),Invoer!B119)","v":false},{"$f":"IF(NOT(Invoer!D119=\"\"),Invoer!D119,)","v":0},{"$f":"IF(NOT(Invoer!E119=\"\"),Invoer!E119,)","v":0},{"$f":"IF(NOT(Invoer!F119=\"\"),Invoer!F119,)","v":0},{"$f":"IF(NOT(Invoer!G119=\"\"),Invoer!G119,)","v":0},{"$f":"IF(Invoer!H119=\"\",\"-\",Invoer!H119)","v":"-"}]
[{"$f":"Invoer!A$4&Invoer!B$4&TEXT(Invoer!C$4,\"dd-mm-jjjj\")&TEXT(Invoer!D$4,\"uu:mm\")","v":"00-01-190000:00"},{"$f":"IF(NOT(Invoer!B120=\"\"),Invoer!B120)","v":false},{"$f":"IF(NOT(Invoer!D120=\"\"),Invoer!D120,)","v":0},{"$f":"IF(NOT(Invoer!E120=\"\"),Invoer!E120,)","v":0},{"$f":"IF(NOT(Invoer!F120=\"\"),Invoer!F120,)","v":0},{"$f":"IF(NOT(Invoer!G120=\"\"),Invoer!G120,)","v":0},{"$f":"IF(Invoer!H120=\"\",\"-\",Invoer!H120)","v":"-"}]
[{"$f":"Invoer!A$4&Invoer!B$4&TEXT(Invoer!C$4,\"dd-mm-jjjj\")&TEXT(Invoer!D$4,\"uu:mm\")","v":"00-01-190000:00"},{"$f":"IF(NOT(Invoer!B121=\"\"),Invoer!B121)","v":false},{"$f":"IF(NOT(Invoer!D121=\"\"),Invoer!D121,)","v":0},{"$f":"IF(NOT(Invoer!E121=\"\"),Invoer!E121,)","v":0},{"$f":"IF(NOT(Invoer!F121=\"\"),Invoer!F121,)","v":0},{"$f":"IF(NOT(Invoer!G121=\"\"),Invoer!G121,)","v":0},{"$f":"IF(Invoer!H121=\"\",\"-\",Invoer!H121)","v":"-"}]
[{"$f":"Invoer!A$4&Invoer!B$4&TEXT(Invoer!C$4,\"dd-mm-jjjj\")&TEXT(Invoer!D$4,\"uu:mm\")","v":"00-01-190000:00"},{"$f":"IF(NOT(Invoer!B122=\"\"),Invoer!B122)","v":false},{"$f":"IF(NOT(Invoer!D122=\"\"),Invoer!D122,)","v":0},{"$f":"IF(NOT(Invoer!E122=\"\"),Invoer!E122,)","v":0},{"$f":"IF(NOT(Invoer!F122=\"\"),Invoer!F122,)","v":0},{"$f":"IF(NOT(Invoer!G122=\"\"),Invoer!G122,)","v":0},{"$f":"IF(Invoer!H122=\"\",\"-\",Invoer!H122)","v":"-"}]
[{"$f":"Invoer!A$4&Invoer!B$4&TEXT(Invoer!C$4,\"dd-mm-jjjj\")&TEXT(Invoer!D$4,\"uu:mm\")","v":"00-01-190000:00"},{"$f":"IF(NOT(Invoer!B123=\"\"),Invoer!B123)","v":false},{"$f":"IF(NOT(Invoer!D123=\"\"),Invoer!D123,)","v":0},{"$f":"IF(NOT(Invoer!E123=\"\"),Invoer!E123,)","v":0},{"$f":"IF(NOT(Invoer!F123=\"\"),Invoer!F123,)","v":0},{"$f":"IF(NOT(Invoer!G123=\"\"),Invoer!G123,)","v":0},{"$f":"IF(Invoer!H123=\"\",\"-\",Invoer!H123)","v":"-"}]
[{"$f":"Invoer!A$4&Invoer!B$4&TEXT(Invoer!C$4,\"dd-mm-jjjj\")&TEXT(Invoer!D$4,\"uu:mm\")","v":"00-01-190000:00"},{"$f":"IF(NOT(Invoer!B124=\"\"),Invoer!B124)","v":false},{"$f":"IF(NOT(Invoer!D124=\"\"),Invoer!D124,)","v":0},{"$f":"IF(NOT(Invoer!E124=\"\"),Invoer!E124,)","v":0},{"$f":"IF(NOT(Invoer!F124=\"\"),Invoer!F124,)","v":0},{"$f":"IF(NOT(Invoer!G124=\"\"),Invoer!G124,)","v":0},{"$f":"IF(Invoer!H124=\"\",\"-\",Invoer!H124)","v":"-"}]
[{"$f":"Invoer!A$4&Invoer!B$4&TEXT(Invoer!C$4,\"dd-mm-jjjj\")&TEXT(Invoer!D$4,\"uu:mm\")","v":"00-01-190000:00"},{"$f":"IF(NOT(Invoer!B125=\"\"),Invoer!B125)","v":false},{"$f":"IF(NOT(Invoer!D125=\"\"),Invoer!D125,)","v":0},{"$f":"IF(NOT(Invoer!E125=\"\"),Invoer!E125,)","v":0},{"$f":"IF(NOT(Invoer!F125=\"\"),Invoer!F125,)","v":0},{"$f":"IF(NOT(Invoer!G125=\"\"),Invoer!G125,)","v":0},{"$f":"IF(Invoer!H125=\"\",\"-\",Invoer!H125)","v":"-"}]
[{"$f":"Invoer!A$4&Invoer!B$4&TEXT(Invoer!C$4,\"dd-mm-jjjj\")&TEXT(Invoer!D$4,\"uu:mm\")","v":"00-01-190000:00"},{"$f":"IF(NOT(Invoer!B126=\"\"),Invoer!B126)","v":false},{"$f":"IF(NOT(Invoer!D126=\"\"),Invoer!D126,)","v":0},{"$f":"IF(NOT(Invoer!E126=\"\"),Invoer!E126,)","v":0},{"$f":"IF(NOT(Invoer!F126=\"\"),Invoer!F126,)","v":0},{"$f":"IF(NOT(Invoer!G126=\"\"),Invoer!G126,)","v":0},{"$f":"IF(Invoer!H126=\"\",\"-\",Invoer!H126)","v":"-"}]
[{"$f":"Invoer!A$4&Invoer!B$4&TEXT(Invoer!C$4,\"dd-mm-jjjj\")&TEXT(Invoer!D$4,\"uu:mm\")","v":"00-01-190000:00"},{"$f":"IF(NOT(Invoer!B127=\"\"),Invoer!B127)","v":false},{"$f":"IF(NOT(Invoer!D127=\"\"),Invoer!D127,)","v":0},{"$f":"IF(NOT(Invoer!E127=\"\"),Invoer!E127,)","v":0},{"$f":"IF(NOT(Invoer!F127=\"\"),Invoer!F127,)","v":0},{"$f":"IF(NOT(Invoer!G127=\"\"),Invoer!G127,)","v":0},{"$f":"IF(Invoer!H127=\"\",\"-\",Invoer!H127)","v":"-"}]
[{"$f":"Invoer!A$4&Invoer!B$4&TEXT(Invoer!C$4,\"dd-mm-jjjj\")&TEXT(Invoer!D$4,\"uu:mm\")","v":"00-01-190000:00"},{"$f":"IF(NOT(Invoer!B128=\"\"),Invoer!B128)","v":false},{"$f":"IF(NOT(Invoer!D128=\"\"),Invoer!D128,)","v":0},{"$f":"IF(NOT(Invoer!E128=\"\"),Invoer!E128,)","v":0},{"$f":"IF(NOT(Invoer!F128=\"\"),Invoer!F128,)","v":0},{"$f":"IF(NOT(Invoer!G128=\"\"),Invoer!G128,)","v":0},{"$f":"IF(Invoer!H128=\"\",\"-\",Invoer!H128)","v":"-"}]
[{"$f":"Invoer!A$4&Invoer!B$4&TEXT(Invoer!C$4,\"dd-mm-jjjj\")&TEXT(Invoer!D$4,\"uu:mm\")","v":"00-01-190000:00"},{"$f":"IF(NOT(Invoer!B129=\"\"),Invoer!B129)","v":false},{"$f":"IF(NOT(Invoer!D129=\"\"),Invoer!D129,)","v":0},{"$f":"IF(NOT(Invoer!E129=\"\"),Invoer!E129,)","v":0},{"$f":"IF(NOT(Invoer!F129=\"\"),Invoer!F129,)","v":0},{"$f":"IF(NOT(Invoer!G129=\"\"),Invoer!G129,)","v":0},{"$f":"IF(Invoer!H129=\"\",\"-\",Invoer!H129)","v":"-"}]
[{"$f":"Invoer!A$4&Invoer!B$4&TEXT(Invoer!C$4,\"dd-mm-jjjj\")&TEXT(Invoer!D$4,\"uu:mm\")","v":"00-01-190000:00"},{"$f":"IF(NOT(Invoer!B130=\"\"),Invoer!B130)","v":false},{"$f":"IF(NOT(Invoer!D130=\"\"),Invoer!D130,)","v":0},{"$f":"IF(NOT(Invoer!E130=\"\"),Invoer!E130,)","v":0},{"$f":"IF(NOT(Invoer!F130=\"\"),Invoer!F130,)","v":0},{"$f":"IF(NOT(Invoer!G130=\"\"),Invoer!G130,)","v":0},{"$f":"IF(Invoer!H130=\"\",\"-\",Invoer!H130)","v":"-"}]
[{"$f":"Invoer!A$4&Invoer!B$4&TEXT(Invoer!C$4,\"dd-mm-jjjj\")&TEXT(Invoer!D$4,\"uu:mm\")","v":"00-01-190000:00"},{"$f":"IF(NOT(Invoer!B131=\"\"),Invoer!B131)","v":false},{"$f":"IF(NOT(Invoer!D131=\"\"),Invoer!D131,)","v":0},{"$f":"IF(NOT(Invoer!E131=\"\"),Invoer!E131,)","v":0},{"$f":"IF(NOT(Invoer!F131=\"\"),Invoer!F131,)","v":0},{"$f":"IF(NOT(Invoer!G131=\"\"),Invoer!G131,)","v":0},{"$f":"IF(Invoer!H131=\"\",\"-\",Invoer!H131)","v":"-"}]
[{"$f":"Invoer!A$4&Invoer!B$4&TEXT(Invoer!C$4,\"dd-mm-jjjj\")&TEXT(Invoer!D$4,\"uu:mm\")","v":"00-01-190000:00"},{"$f":"IF(NOT(Invoer!B132=\"\"),Invoer!B132)","v":false},{"$f":"IF(NOT(Invoer!D132=\"\"),Invoer!D132,)","v":0},{"$f":"IF(NOT(Invoer!E132=\"\"),Invoer!E132,)","v":0},{"$f":"IF(NOT(Invoer!F132=\"\"),Invoer!F132,)","v":0},{"$f":"IF(NOT(Invoer!G132=\"\"),Invoer!G132,)","v":0},{"$f":"IF(Invoer!H132=\"\",\"-\",Invoer!H132)","v":"-"}]
[{"$f":"Invoer!A$4&Invoer!B$4&TEXT(Invoer!C$4,\"dd-mm-jjjj\")&TEXT(Invoer!D$4,\"uu:mm\")","v":"00-01-190000:00"},{"$f":"IF(NOT(Invoer!B133=\"\"),Invoer!B133)","v":false},{"$f":"IF(NOT(Invoer!D133=\"\"),Invoer!D133,)","v":0},{"$f":"IF(NOT(Invoer!E133=\"\"),Invoer!E133,)","v":0},{"$f":"IF(NOT(Invoer!F133=\"\"),Invoer!F133,)","v":0},{"$f":"IF(NOT(Invoer!G133=\"\"),Invoer!G133,)","v":0},{"$f":"IF(Invoer!H133=\"\",\"-\",Invoer!H133)","v":"-"}]
[{"$f":"Invoer!A$4&Invoer!B$4&TEXT(Invoer!C$4,\"dd-mm-jjjj\")&TEXT(Invoer!D$4,\"uu:mm\")","v":"00-01-190000:00"},{"$f":"IF(NOT(Invoer!B134=\"\"),Invoer!B134)","v":false},{"$f":"IF(NOT(Invoer!D134=\"\"),Invoer!D134,)","v":0},{"$f":"IF(NOT(Invoer!E134=\"\"),Invoer!E134,)","v":0},{"$f":"IF(NOT(Invoer!F134=\"\"),Invoer!F134,)","v":0},{"$f":"IF(NOT(Invoer!G134=\"\"),Invoer!G134,)","v":0},{"$f":"IF(Invoer!H134=\"\",\"-\",Invoer!H134)","v":"-"}]
[{"$f":"Invoer!A$4&Invoer!B$4&TEXT(Invoer!C$4,\"dd-mm-jjjj\")&TEXT(Invoer!D$4,\"uu:mm\")","v":"00-01-190000:00"},{"$f":"IF(NOT(Invoer!B135=\"\"),Invoer!B135)","v":false},{"$f":"IF(NOT(Invoer!D135=\"\"),Invoer!D135,)","v":0},{"$f":"IF(NOT(Invoer!E135=\"\"),Invoer!E135,)","v":0},{"$f":"IF(NOT(Invoer!F135=\"\"),Invoer!F135,)","v":0},{"$f":"IF(NOT(Invoer!G135=\"\"),Invoer!G135,)","v":0},{"$f":"IF(Invoer!H135=\"\",\"-\",Invoer!H135)","v":"-"}]
[{"$f":"Invoer!A$4&Invoer!B$4&TEXT(Invoer!C$4,\"dd-mm-jjjj\")&TEXT(Invoer!D$4,\"uu:mm\")","v":"00-01-190000:00"},{"$f":"IF(NOT(Invoer!B136=\"\"),Invoer!B136)","v":false},{"$f":"IF(NOT(Invoer!D136=\"\"),Invoer!D136,)","v":0},{"$f":"IF(NOT(Invoer!E136=\"\"),Invoer!E136,)","v":0},{"$f":"IF(NOT(Invoer!F136=\"\"),Invoer!F136,)","v":0},{"$f":"IF(NOT(Invoer!G136=\"\"),Invoer!G136,)","v":0},{"$f":"IF(Invoer!H136=\"\",\"-\",Invoer!H136)","v":"-"}]
[{"$f":"Invoer!A$4&Invoer!B$4&TEXT(Invoer!C$4,\"dd-mm-jjjj\")&TEXT(Invoer!D$4,\"uu:mm\")","v":"00-01-190000:00"},{"$f":"IF(NOT(Invoer!B137=\"\"),Invoer!B137)","v":false},{"$f":"IF(NOT(Invoer!D137=\"\"),Invoer!D137,)","v":0},{"$f":"IF(NOT(Invoer!E137=\"\"),Invoer!E137,)","v":0},{"$f":"IF(NOT(Invoer!F137=\"\"),Invoer!F137,)","v":0},{"$f":"IF(NOT(Invoer!G137=\"\"),Invoer!G137,)","v":0},{"$f":"IF(Invoer!H137=\"\",\"-\",Invoer!H137)","v":"-"}]
[{"$f":"Invoer!A$4&Invoer!B$4&TEXT(Invoer!C$4,\"dd-mm-jjjj\")&TEXT(Invoer!D$4,\"uu:mm\")","v":"00-01-190000:00"},{"$f":"IF(NOT(Invoer!B138=\"\"),Invoer!B138)","v":false},{"$f":"IF(NOT(Invoer!D138=\"\"),Invoer!D138,)","v":0},{"$f":"IF(NOT(Invoer!E138=\"\"),Invoer!E138,)","v":0},{"$f":"IF(NOT(Invoer!F138=\"\"),Invoer!F138,)","v":0},{"$f":"IF(NOT(Invoer!G138=\"\"),Invoer!G138,)","v":0},{"$f":"IF(Invoer!H138=\"\",\"-\",Invoer!H138)","v":"-"}]
[{"$f":"Invoer!A$4&Invoer!B$4&TEXT(Invoer!C$4,\"dd-mm-jjjj\")&TEXT(Invoer!D$4,\"uu:mm\")","v":"00-01-190000:00"},{"$f":"IF(NOT(Invoer!B139=\"\"),Invoer!B139)","v":false},{"$f":"IF(NOT(Invoer!D139=\"\"),Invoer!D139,)","v":0},{"$f":"IF(NOT(Invoer!E139=\"\"),Invoer!E139,)","v":0},{"$f":"IF(NOT(Invoer!F139=\"\"),Invoer!F139,)","v":0},{"$f":"IF(NOT(Invoer!G139=\"\"),Invoer!G139,)","v":0},{"$f":"IF(Invoer!H139=\"\",\"-\",Invoer!H139)","v":"-"}]
[{"$f":"Invoer!A$4&Invoer!B$4&TEXT(Invoer!C$4,\"dd-mm-jjjj\")&TEXT(Invoer!D$4,\"uu:mm\")","v":"00-01-190000:00"},{"$f":"IF(NOT(Invoer!B140=\"\"),Invoer!B140)","v":false},{"$f":"IF(NOT(Invoer!D140=\"\"),Invoer!D140,)","v":0},{"$f":"IF(NOT(Invoer!E140=\"\"),Invoer!E140,)","v":0},{"$f":"IF(NOT(Invoer!F140=\"\"),Invoer!F140,)","v":0},{"$f":"IF(NOT(Invoer!G140=\"\"),Invoer!G140,)","v":0},{"$f":"IF(Invoer!H140=\"\",\"-\",Invoer!H140)","v":"-"}]
[{"$f":"Invoer!A$4&Invoer!B$4&TEXT(Invoer!C$4,\"dd-mm-jjjj\")&TEXT(Invoer!D$4,\"uu:mm\")","v":"00-01-190000:00"},{"$f":"IF(NOT(Invoer!B141=\"\"),Invoer!B141)","v":false},{"$f":"IF(NOT(Invoer!D141=\"\"),Invoer!D141,)","v":0},{"$f":"IF(NOT(Invoer!E141=\"\"),Invoer!E141,)","v":0},{"$f":"IF(NOT(Invoer!F141=\"\"),Invoer!F141,)","v":0},{"$f":"IF(NOT(Invoer!G141=\"\"),Invoer!G141,)","v":0},{"$f":"IF(Invoer!H141=\"\",\"-\",Invoer!H141)","v":"-"}]
[{"$f":"Invoer!A$4&Invoer!B$4&TEXT(Invoer!C$4,\"dd-mm-jjjj\")&TEXT(Invoer!D$4,\"uu:mm\")","v":"00-01-190000:00"},{"$f":"IF(NOT(Invoer!B142=\"\"),Invoer!B142)","v":false},{"$f":"IF(NOT(Invoer!D142=\"\"),Invoer!D142,)","v":0},{"$f":"IF(NOT(Invoer!E142=\"\"),Invoer!E142,)","v":0},{"$f":"IF(NOT(Invoer!F142=\"\"),Invoer!F142,)","v":0},{"$f":"IF(NOT(Invoer!G142=\"\"),Invoer!G142,)","v":0},{"$f":"IF(Invoer!H142=\"\",\"-\",Invoer!H142)","v":"-"}]
[{"$f":"Invoer!A$4&Invoer!B$4&TEXT(Invoer!C$4,\"dd-mm-jjjj\")&TEXT(Invoer!D$4,\"uu:mm\")","v":"00-01-190000:00"},{"$f":"IF(NOT(Invoer!B143=\"\"),Invoer!B143)","v":false},{"$f":"IF(NOT(Invoer!D143=\"\"),Invoer!D143,)","v":0},{"$f":"IF(NOT(Invoer!E143=\"\"),Invoer!E143,)","v":0},{"$f":"IF(NOT(Invoer!F143=\"\"),Invoer!F143,)","v":0},{"$f":"IF(NOT(Invoer!G143=\"\"),Invoer!G143,)","v":0},{"$f":"IF(Invoer!H143=\"\",\"-\",Invoer!H143)","v":"-"}]
[{"$f":"Invoer!A$4&Invoer!B$4&TEXT(Invoer!C$4,\"dd-mm-jjjj\")&TEXT(Invoer!D$4,\"uu:mm\")","v":"00-01-190000:00"},{"$f":"IF(NOT(Invoer!B144=\"\"),Invoer!B144)","v":false},{"$f":"IF(NOT(Invoer!D144=\"\"),Invoer!D144,)","v":0},{"$f":"IF(NOT(Invoer!E144=\"\"),Invoer!E144,)","v":0},{"$f":"IF(NOT(Invoer!F144=\"\"),Invoer!F144,)","v":0},{"$f":"IF(NOT(Invoer!G144=\"\"),Invoer!G144,)","v":0},{"$f":"IF(Invoer!H144=\"\",\"-\",Invoer!H144)","v":"-"}]
[{"$f":"Invoer!A$4&Invoer!B$4&TEXT(Invoer!C$4,\"dd-mm-jjjj\")&TEXT(Invoer!D$4,\"uu:mm\")","v":"00-01-190000:00"},{"$f":"IF(NOT(Invoer!B145=\"\"),Invoer!B145)","v":false},{"$f":"IF(NOT(Invoer!D145=\"\"),Invoer!D145,)","v":0},{"$f":"IF(NOT(Invoer!E145=\"\"),Invoer!E145,)","v":0},{"$f":"IF(NOT(Invoer!F145=\"\"),Invoer!F145,)","v":0},{"$f":"IF(NOT(Invoer!G145=\"\"),Invoer!G145,)","v":0},{"$f":"IF(Invoer!H145=\"\",\"-\",Invoer!H145)","v":"-"}]
[{"$f":"Invoer!A$4&Invoer!B$4&TEXT(Invoer!C$4,\"dd-mm-jjjj\")&TEXT(Invoer!D$4,\"uu:mm\")","v":"00-01-190000:00"},{"$f":"IF(NOT(Invoer!B146=\"\"),Invoer!B146)","v":false},{"$f":"IF(NOT(Invoer!D146=\"\"),Invoer!D146,)","v":0},{"$f":"IF(NOT(Invoer!E146=\"\"),Invoer!E146,)","v":0},{"$f":"IF(NOT(Invoer!F146=\"\"),Invoer!F146,)","v":0},{"$f":"IF(NOT(Invoer!G146=\"\"),Invoer!G146,)","v":0},{"$f":"IF(Invoer!H146=\"\",\"-\",Invoer!H146)","v":"-"}]